Benzoic acid, 2,4-dimethoxy-, methyl ester
- Formula: C10H12O4
- Molecular weight: 196.1999
- IUPAC Standard InChIKey: IHIJFZWLGPEYPJ-UHFFFAOYSA-N
- CAS Registry Number: 2150-41-6
- Chemical structure:
View 3d structure (requires JavaScript / HTML 5) - Other names: Methyl 2,4-dimethoxybenzoate; 2,4-Dimethoxybenzoic acid methyl ester; 2,4-Dihydroxybenzoic acid, dimethyl ether, methyl ester

Van Den Dool and Kratz RI, non-polar column, temperature ramp

Column type | Active phase | I | Reference | Comment |
---|---|---|---|---|
Capillary | VF-5MS | 1621. | Todua, 2011 | 30. m/0.25 mm/0.25 μm, He; Tstart: 60. C; Tend: 270. C |

Van Den Dool and Kratz RI, non-polar column, custom temperature program

Column type | Active phase | I | Reference | Comment |
---|---|---|---|---|
Capillary | VF-5MS | 1614.5 | Tret'yakov, 2008 | 30. m/0.25 mm/0.25 μm, He; Program: Multi-step temperature program; T(initial)=60C; T(final)=270C |

References

Todua, 2011
Todua, N.G.,
Retention Data. NIST Mass Spectrometry Data Center., NIST Mass Spectrometry Data Center, 2011. [all data]
Tret'yakov, 2008
Tret'yakov, K.V.,
Retention Data. NIST Mass Spectrometry Data Center., NIST Mass Spectrometry Data Center, 2008. [all data]