Bicyclo[2.2.1]heptane, 2-ethyl-
- Formula: C9H16
- Molecular weight: 124.2233
- IUPAC Standard InChIKey: DEMFSGPWYVAINM-UHFFFAOYSA-N
- CAS Registry Number: 2146-41-0
- Chemical structure:
View 3d structure (requires JavaScript / HTML 5) - Stereoisomers:
- Other names: Norbornane, 2-ethyl-; 2-Ethylbicyclo[2.2.1]heptane; 5-Ethylnorbornane; 2-Ethylnorbornane (exo?)

Condensed phase thermochemistry data

Data compiled by: Hussein Y. Afeefy, Joel F. Liebman, and Stephen E. Stein
Quantity | Value | Units | Method | Reference | Comment |
---|---|---|---|---|---|
ΔfH°liquid | -140.3 ± 1.9 | kJ/mol | Ccb | Kozina, Bychikhina, et al., 1975 | |
Quantity | Value | Units | Method | Reference | Comment |
ΔcH°liquid | -5688.0 ± 1.8 | kJ/mol | Ccb | Kozina, Bychikhina, et al., 1975 | Corresponding ΔfHºliquid = -140.2 kJ/mol (simple calculation by NIST; no Washburn corrections) |

Phase change data

Data compiled by: William E. Acree, Jr., James S. Chickos
Enthalpy of vaporization
ΔvapH (kJ/mol) | Temperature (K) | Method | Reference | Comment |
---|---|---|---|---|
44.4 | 364. | A | Stephenson and Malanowski, 1987 | Based on data from 349. to 396. K. |

Kovats' RI, non-polar column, isothermal

Column type | Active phase | Temperature (C) | I | Reference | Comment |
---|---|---|---|---|---|
Capillary | SE-30 | 70. | 919.9 | Tóth, 1983 | N2; Column length: 15. m; Column diameter: 0.25 mm |
Capillary | SE-30 | 70. | 915.9 | Tóth, 1983 | N2; Column length: 15. m; Column diameter: 0.25 mm |

Kovats' RI, polar column, isothermal

Column type | Active phase | Temperature (C) | I | Reference | Comment |
---|---|---|---|---|---|
Capillary | PEG-20M | 70. | 1015.1 | Tóth, 1983 | N2; Column length: 30. m; Column diameter: 0.3 mm |

References

Kozina, Bychikhina, et al., 1975
Kozina, M.P.; Bychikhina, L.V.; Gal'chenko, G.L.; Ordubadi, M.; Belikova, N.A.; Plate, A.F.,
Enthalpies of combustion of 7,7-dimethyl-and 2-ethyl-bicyclo[2,2,1]heptanes,
Russ. J. Phys. Chem. (Engl. Transl.), 1975, 49, 141. [all data]
Stephenson and Malanowski, 1987
Stephenson, Richard M.; Malanowski, Stanislaw,
Handbook of the Thermodynamics of Organic Compounds, 1987, https://doi.org/10.1007/978-94-009-3173-2
. [all data]
Tóth, 1983
Tóth, T.,
Use of capillary gas chromatography in collecting retention and chemical information for the analysis of complex petrochemical mixtures,
J. Chromatogr., 1983, 279, 157-165, https://doi.org/10.1016/S0021-9673(01)93614-3
. [all data]