1,2,3,4-Tetramethoxybenzene
- Formula: C10H14O4
- Molecular weight: 198.2158
- IUPAC Standard InChIKey: QCNHIJXDZKTWSA-UHFFFAOYSA-N
- CAS Registry Number: 21450-56-6
- Chemical structure:
View 3d structure (requires JavaScript / HTML 5) - Permanent link for this species. Use this link for bookmarking this species for future reference.

Van Den Dool and Kratz RI, non-polar column, temperature ramp

Column type | Active phase | I | Reference | Comment |
---|---|---|---|---|
Capillary | DB-5 | 1533. | Wu, Zorn, et al., 2007 | 30. m/0.32 mm/0.25 μm, He, 40. C @ 2. min, 5. K/min, 250. C @ 5. min |

Van Den Dool and Kratz RI, polar column, temperature ramp

Column type | Active phase | I | Reference | Comment |
---|---|---|---|---|
Capillary | ZB-Wax | 2321. | Wu, Zorn, et al., 2007 | 30. m/0.32 mm/0.25 μm, He, 40. C @ 2. min, 5. K/min, 250. C @ 5. min |

Normal alkane RI, non-polar column, temperature ramp

Column type | Active phase | I | Reference | Comment |
---|---|---|---|---|
Capillary | HP-5 | 1533. | N/A | 30. m/0.32 mm/0.25 μm, Helium, 40. C @ 2. min, 5. K/min, 250. C @ 5. min |

Normal alkane RI, polar column, temperature ramp

Column type | Active phase | I | Reference | Comment |
---|---|---|---|---|
Capillary | CP Wax 52 CB | 2279. | Chen, Chyau, et al., 2007 | 60. m/0.25 mm/0.25 μm, Helium, 3. K/min; Tstart: 40. C; Tend: 220. C |
Capillary | ZB-Wax | 2321. | N/A | 30. m/0.32 mm/0.25 μm, Helium, 40. C @ 2. min, 5. K/min, 250. C @ 5. min |

References

Wu, Zorn, et al., 2007
Wu, S.; Zorn, H.; Krings, U.; Berger, R.G.,
Volatiles from submerged and surface-cultured beefsteak fungus, Fistulina hepatica,
Flavour Fragr. J., 2007, 22, 1, 53-60, https://doi.org/10.1002/ffj.1758
. [all data]
Chen, Chyau, et al., 2007
Chen, C.-C.; Chyau, C.-C.; Hseu, TY.-H.,
Production of a COX-2 inhibitor, 2,4,5-trimethoxybenzaldehyde, with submerged cultured Antrodia camphorata,
Lett. Appl. Microbiol., 2007, 44, 4, 387-392, https://doi.org/10.1111/j.1472-765X.2006.02087.x
. [all data]