1-Pentene, 1-chloro-
- Formula: C5H9Cl
- Molecular weight: 104.578
- IUPAC Standard InChIKey: NKNYZKFBNQUWTM-SNAWJCMRSA-N
- CAS Registry Number: 21450-13-5
- Chemical structure:
View 3d structure (requires JavaScript / HTML 5) - Species with the same structure:
- Stereoisomers:
- Other names: 1-chloro-1-pentene

Normal alkane RI, non-polar column, temperature ramp

Column type | Active phase | I | Reference | Comment |
---|---|---|---|---|
Capillary | OV-101 | 730. | Zenkevich, 2005 | 25. m/0.20 mm/0.10 μm, N2/He, 6. K/min; Tstart: 50. C; Tend: 250. C |

References

Zenkevich, 2005
Zenkevich, I.G.,
Experimentally measured retention indices., 2005. [all data]