Furan, tetrahydro-2,5-dimethyl-, cis-
- Formula: C6H12O
- Molecular weight: 100.1589
- IUPAC Standard InChIKey: OXMIDRBAFOEOQT-OLQVQODUSA-N
- CAS Registry Number: 2144-41-4
- Chemical structure:
View 3d structure (requires JavaScript / HTML 5) - Stereoisomers:
- Other names: cis-Tetrahydro-2,5-Dimethylfuran; cis-2,5-Dimethyltetrahydrofuran; 2,5-Dimethyltetrahydrofuran, (Z)-

Phase change data

Data compiled by: Thermodynamics Research Center, NIST Boulder Laboratories, Chris Muzny director
Quantity | Value | Units | Method | Reference | Comment |
---|---|---|---|---|---|
Tboil | 364.65 | K | N/A | Gagnaire and Monzeglio, 1965 | Uncertainty assigned by TRC = 1. K |

References

Gagnaire and Monzeglio, 1965
Gagnaire, D.; Monzeglio, P.,
Stereochemical Studies in the Tetraahydrofuran Series V. Configuration of Symmetrical Substituted Dihydrofuran and Tetrahydrofuran,
Bull. Soc. Chim. Fr., 1965, 1965, 474. [all data]