(1S,2S)-(+)-1,2-Diaminocyclohexane
- Formula: C6H14N2
- Molecular weight: 114.1888
- IUPAC Standard InChIKey: SSJXIUAHEKJCMH-PHDIDXHHSA-N
- CAS Registry Number: 21436-03-3
- Chemical structure:
View 3d structure (requires JavaScript / HTML 5) - Stereoisomers:
- Other names: (+)-S,S-1,2-Diaminocyclohexane; 1,2-Cyclohexanediamine, (1S,2S)-; SS-Jacobsen Catalyst 2

Phase change data

Data compiled by: Robert L. Brown and Stephen E. Stein
Reduced pressure boiling point
Tboil (K) | Pressure (bar) | Reference |
---|---|---|
380.2 | 0.053 | Aldrich Chemical Company Inc., 1990 |

References

Aldrich Chemical Company Inc., 1990
Aldrich Chemical Company Inc.,
Catalog Handbook of Fine Chemicals, Aldrich Chemical Company, Inc., Milwaukee WI, 1990, 1. [all data]