Ethanone, 1-(2,5-dimethylphenyl)-
- Formula: C10H12O
- Molecular weight: 148.2017
- IUPAC Standard InChIKey: AWKBVLVKQQRRFQ-UHFFFAOYSA-N
- CAS Registry Number: 2142-73-6
- Chemical structure:
View 3d structure (requires JavaScript / HTML 5) - Other names: Acetophenone, 2',5'-dimethyl-; 2,5-Dimethylacetophenone; 2',5'-Dimethylacetophenone; 2,5-(CH3)2C6H3-COCH3; 1-(2,5-dimethylphenyl)ethan-1-one

Gas phase ion energetics data

Data evaluated by: Edward P. Hunter and Sharon G. Lias
Quantity | Value | Units | Method | Reference | Comment |
---|---|---|---|---|---|
Proton affinity (review) | 873.5 | kJ/mol | N/A | Hunter and Lias, 1998 | |
Quantity | Value | Units | Method | Reference | Comment |
Gas basicity | 841.6 | kJ/mol | N/A | Hunter and Lias, 1998 |

Phase change data

Data compiled by: Thermodynamics Research Center, NIST Boulder Laboratories, Chris Muzny director
Quantity | Value | Units | Method | Reference | Comment |
---|---|---|---|---|---|
Tfus | 255.1 | K | N/A | Birch, Dean, et al., 1949 | Uncertainty assigned by TRC = 0.7 K |

References

Hunter and Lias, 1998
Hunter, E.P.; Lias, S.G.,
Evaluated Gas Phase Basicities and Proton Affinities of Molecules: An Update,
J. Phys. Chem. Ref. Data, 1998, 27, 3, 413-656, https://doi.org/10.1063/1.556018
. [all data]