Anthracene, 1,2,3,4-tetrahydro-
- Formula: C14H14
- Molecular weight: 182.2610
- IUPAC Standard InChIKey: XBDYBAVJXHJMNQ-UHFFFAOYSA-N
- CAS Registry Number: 2141-42-6
- Chemical structure:
View 3d structure (requires JavaScript / HTML 5) - Other names: 1,2,3,4-tetrahydroanthracene

Gas phase thermochemistry data

Data compiled by: Glushko Thermocenter, Russian Academy of Sciences, Moscow
Constant pressure heat capacity of gas
Cp,gas (J/mol*K) | Temperature (K) | Reference | Comment |
---|---|---|---|
45.41 | 50. | Dorofeeva O.V., 1988 | Recommended values were calculated statistically mechanically using force field approximation for polycyclic aromatic hydrocarbons to estimate the needed vibrational frequencies (see also [ Dorofeeva O.V., 1986]). These functions are reproduced in the reference book [ Frenkel M., 1994]. |
69.53 | 100. | ||
97.63 | 150. | ||
129.33 | 200. | ||
181.24 | 273.15 | ||
199.7 ± 2.5 | 298.15 | ||
201.04 | 300. | ||
272.32 | 400. | ||
333.83 | 500. | ||
384.27 | 600. | ||
425.41 | 700. | ||
459.31 | 800. | ||
487.55 | 900. | ||
511.27 | 1000. | ||
531.32 | 1100. | ||
548.38 | 1200. | ||
562.94 | 1300. | ||
575.43 | 1400. | ||
586.20 | 1500. |

Condensed phase thermochemistry data

Data compiled by: Eugene S. Domalski and Elizabeth D. Hearing
Quantity | Value | Units | Method | Reference | Comment |
---|---|---|---|---|---|
S°solid,1 bar | 227.12 | J/mol*K | N/A | Chirico, Hossenlopp, et al., 1987 | crystaline, II phase |
Constant pressure heat capacity of solid
Cp,solid (J/mol*K) | Temperature (K) | Reference | Comment |
---|---|---|---|
247.02 | 298.15 | Chirico, Hossenlopp, et al., 1987 | crystaline, II phase; T = 10 to 500 K. |

Phase change data

Data compiled as indicated in comments:
TRC - Thermodynamics Research Center, NIST Boulder Laboratories, Chris Muzny director
AC - William E. Acree, Jr., James S. Chickos
CAL - James S. Chickos, William E. Acree, Jr., Joel F. Liebman, Students of Chem 202 (Introduction to the Literature of Chemistry), University of Missouri -- St. Louis
DH - Eugene S. Domalski and Elizabeth D. Hearing
Quantity | Value | Units | Method | Reference | Comment |
---|---|---|---|---|---|
Ttriple | 373.240 | K | N/A | Chirico, Hossenlopp, et al., 1987, 2 | Crystal phase 1 phase; Uncertainty assigned by TRC = 0.01 K; TRC |
Enthalpy of fusion
ΔfusH (kJ/mol) | Temperature (K) | Reference | Comment |
---|---|---|---|
2.92 | 388. | Domalski and Hearing, 1996 | AC |
Entropy of fusion
ΔfusS (J/mol*K) | Temperature (K) | Reference | Comment |
---|---|---|---|
51.33 | 373.3 | Domalski and Hearing, 1996 | CAL |
7.53 | 388. |
Enthalpy of phase transition
ΔHtrs (kJ/mol) | Temperature (K) | Initial Phase | Final Phase | Reference | Comment |
---|---|---|---|---|---|
2.921 | 388.0 | crystaline, II | crystaline, I | Chirico, Hossenlopp, et al., 1987 | DH |
19.157 | 373.245 | crystaline, I | liquid | Chirico, Hossenlopp, et al., 1987 | DH |
Entropy of phase transition
ΔStrs (J/mol*K) | Temperature (K) | Initial Phase | Final Phase | Reference | Comment |
---|---|---|---|---|---|
7.53 | 388.0 | crystaline, II | crystaline, I | Chirico, Hossenlopp, et al., 1987 | DH |
51.33 | 373.245 | crystaline, I | liquid | Chirico, Hossenlopp, et al., 1987 | DH |

References

Dorofeeva O.V., 1988
Dorofeeva O.V.,
Thermodynamic Properties of Polycyclic Aromatic Hydrocarbons in the Gaseous Phase. Institute for High Temperatures, USSR Academy of Sciences, Preprint No.1-238 (in Russian), Moscow, 1988. [all data]
Dorofeeva O.V., 1986
Dorofeeva O.V.,
On calculation of thermodynamic properties of polycyclic aromatic hydrocarbons,
Thermochim. Acta, 1986, 102, 59-66. [all data]
Frenkel M., 1994
Frenkel M.,
Thermodynamics of Organic Compounds in the Gas State, Vol. I, II, Thermodynamics Research Center, College Station, Texas, 1994, 1994. [all data]
Chirico, Hossenlopp, et al., 1987
Chirico, R.D.; Hossenlopp, I.A.; Nguyen, A.; Steele, W.V.,
Thermochemical and thermophysical properties of organic compounds derived from fossil substances. Thermodynamic studies related to the hydrogenation of anthracene,
NIPER Report, 1987, 239, 67p. [all data]
Chirico, Hossenlopp, et al., 1987, 2
Chirico, R.D.; Hossenlopp, I.A.; Nguyen, A.; Steele, W.V.,
Thermochem. and Thermophys. Prop. of Organic Compounds Derived from Fossil Substances. Thermodynamic Studies Related to the Hydrogenation of Anthracene, Natl. Inst. Pet. Energy Res. Rep. NIPER-239, Bartlesvill- e, OK, 1987. [all data]
Domalski and Hearing, 1996
Domalski, Eugene S.; Hearing, Elizabeth D.,
Heat Capacities and Entropies of Organic Compounds in the Condensed Phase. Volume III,
J. Phys. Chem. Ref. Data, 1996, 25, 1, 1, https://doi.org/10.1063/1.555985
. [all data]