Camphor
- Formula: C10H16O
- Molecular weight: 152.2334
- IUPAC Standard InChIKey: DSSYKIVIOFKYAU-UHFFFAOYSA-N
- CAS Registry Number: 21368-68-3
- Chemical structure:
View 3d structure (requires JavaScript / HTML 5) - Species with the same structure:
- Stereoisomers:
- Other names: Bicyclo[2.2.1]heptan-2-one, 1,7,7-trimethyl-; Root bark oil; Spirit of camphor; 1,7,7-Trimethylbicyclo[2.2.1]-2-heptanone; 1,7,7-Trimethylnorcamphor; 2-Bornanone; 2-Camphanone; 1,7,7-Trimethyl-bicyclo[2.2.1]heptan-2-one; 2-Camphonone; Gum camphor; Bornane, 2-oxo-; Camphor, synthetic; Huile de camphre; 2-Kamfanon; Kampfer; 2-Keto-1,7,7-trimethylnorcamphane; Matricaria camphor; Norcamphor, 1,7,7-trimethyl-; UN 2717; Bicyclo[2.2.1]heptane-2-one, 1,7,7-trimethyl-; Alphanon; DL-Camphor; Borneo camphor; Bicyclo[2.2.1]heptan-2-one, 1,7,7-trimethyl-, (.+/-.)-; (.+/-.)-Camphor; Camphre; bornan-2-one; Camphor(DL)

Condensed phase thermochemistry data

Data compiled by: Eugene S. Domalski and Elizabeth D. Hearing
Quantity | Value | Units | Method | Reference | Comment |
---|---|---|---|---|---|
S°solid,1 bar | 290.15 | J/mol*K | N/A | Nagumo, Matsuo, et al., 1989 | crystaline, I phase; Annealed sample. |
S°solid,1 bar | 291.76 | J/mol*K | N/A | Nagumo, Matsuo, et al., 1989 | crystaline, I phase; Quenched sample. |
Constant pressure heat capacity of solid
Cp,solid (J/mol*K) | Temperature (K) | Reference | Comment |
---|---|---|---|
238.7 | 251.22 | Nagumo, Matsuo, et al., 1989 | crystaline, I phase; T = 36 to 252 K. Unsmoothed experimental datum. Annealed sample. |
251.2 | 301.55 | Nagumo, Matsuo, et al., 1989 | crystaline, I phase; T = 14 to 375 K. Unsmoothed experimental datum. Quenched sample. |

Phase change data

Data compiled as indicated in comments:
BS - Robert L. Brown and Stephen E. Stein
TRC - Thermodynamics Research Center, NIST Boulder Laboratories, Chris Muzny director
DH - Eugene S. Domalski and Elizabeth D. Hearing
Quantity | Value | Units | Method | Reference | Comment |
---|---|---|---|---|---|
Tboil | 477.2 | K | N/A | Aldrich Chemical Company Inc., 1990 | BS |
Quantity | Value | Units | Method | Reference | Comment |
Tfus | 445.6 | K | N/A | Andersson and Ross, 1992 | Crystal phase 1 phase; Uncertainty assigned by TRC = 3. K; TRC |
Tfus | 451.3 | K | N/A | Andersson and Ross, 1992 | Crystal phase 1 phase; Uncertainty assigned by TRC = 1.5 K; TRC |
Temperature of phase transition
Ttrs (K) | Initial Phase | Final Phase | Reference | Comment |
---|---|---|---|---|
218.2 | crystaline, II | crystaline, I | Nagumo, Matsuo, et al., 1989 | DH |
209.1 | crystaline, II | crystaline, I | Nagumo, Matsuo, et al., 1989 | DH |
Enthalpy of phase transition
ΔHtrs (kJ/mol) | Temperature (K) | Initial Phase | Final Phase | Reference | Comment |
---|---|---|---|---|---|
0.840 | 210. | crystaline, II | crystaline, I | Schfer, 1953 | DH |
Entropy of phase transition
ΔStrs (J/mol*K) | Temperature (K) | Initial Phase | Final Phase | Reference | Comment |
---|---|---|---|---|---|
4.0 | 210. | crystaline, II | crystaline, I | Schfer, 1953 | DH |

Normal alkane RI, polar column, temperature ramp

Data compiled by: NIST Mass Spectrometry Data Center, William E. Wallace, director

Column type Capillary
Active phase Carbowax 20M
Column length (m) 80.
Carrier gas
Substrate
Column diameter (mm) 0.2
Phase thickness (μm)
Tstart (C) 70.
Tend (C) 170.
Heat rate (K/min) 2.
Initial hold (min)
Final hold (min)
I 1518.
ReferenceEgolf and Jurs, 1993
Comment MSDC-RI

References

Nagumo, Matsuo, et al., 1989
Nagumo, T.; Matsuo, T.; Suga, H.,
Thermodynamic study on camphor crystals,
Thermochim. Acta, 1989, 139, 121-132. [all data]
Aldrich Chemical Company Inc., 1990
Aldrich Chemical Company Inc.,
Catalog Handbook of Fine Chemicals, Aldrich Chemical Company, Inc., Milwaukee WI, 1990, 1. [all data]
Andersson and Ross, 1992
Andersson, O.; Ross, R.G.,
Thermal conductivity of (+)- and (±)-camphor at pressures up to 0.5 GPa and temperatures down to 40 K,
Mol. Phys., 1992, 76, 433-44. [all data]
Schfer, 1953
Schfer, K.,
Fenomenos de orden y desorden en solidos,
An. R. Soc. Esp. Fis. Quim. Ser., 1953, B 49, 161-174. [all data]