2-(Docosanoxy)ethanol

Phase change data

Data compiled as indicated in comments:
TRC - Thermodynamics Research Center, NIST Boulder Laboratories, Chris Muzny director
AC - William E. Acree, Jr., James S. Chickos

Quantity Value Units Method Reference Comment
Tfus337.6KN/AKuchhal, Shukla, et al., 1979Crystal phase 1 phase; Uncertainty assigned by TRC = 0.25 K; TRC

Enthalpy of fusion

ΔfusH (kJ/mol) Temperature (K) Method Reference Comment
43.93335.9DTAKuchhal, Shukla, et al., 1979AC

In addition to the Thermodynamics Research Center (TRC) data available from this site, much more physical and chemical property data is available from the following TRC products:

References

Kuchhal, Shukla, et al., 1979
Kuchhal, Y.K.; Shukla, R.N.; Biswas, A.B., Differential thermal analysis of n-long chain alcohols and corresponding alkoxy ethanols, Thermochimica Acta, 1979, 31, 1, 61-70, https://doi.org/10.1016/0040-6031(79)80008-8 . [all data]