Benzene, (1-propylbutyl)-
- Formula: C13H20
- Molecular weight: 176.2979
- IUPAC Standard InChIKey: NZFVWAOONXJZIQ-UHFFFAOYSA-N
- CAS Registry Number: 2132-86-7
- Chemical structure:
View 3d structure (requires JavaScript / HTML 5) - Other names: Heptane, 4-phenyl-; 4-Phenylheptane; (1-Propylbutyl)benzene

Reaction thermochemistry data

Data compiled by: Hussein Y. Afeefy, Joel F. Liebman, and Stephen E. Stein
Individual Reactions
By formula: C13H20 = C13H20
Quantity | Value | Units | Method | Reference | Comment |
---|---|---|---|---|---|
ΔrH° | 0.02 ± 0.41 | kJ/mol | Eqk | Pimerzin, Nesterova, et al., 1985 | liquid phase; AlCl3 |
ΔrH° | 0.02 ± 0.41 | kJ/mol | Eqk | Nesterova, Pimerzin, et al., 1984 | liquid phase; At 321.4 K, see Pimerzin, Nesterova, et al., 1985, see Pimerzin, Nesterova, et al., 1986 |

Kovats' RI, non-polar column, isothermal

Column type | Active phase | Temperature (C) | I | Reference | Comment |
---|---|---|---|---|---|
Capillary | Apiezon | 150. | 1260. | Schomburg, 1966 | |
Capillary | Apiezon | 200. | 1278. | Schomburg, 1966 |

Normal alkane RI, non-polar column, custom temperature program

Column type | Active phase | I | Reference | Comment |
---|---|---|---|---|
Capillary | HP-5 | 1287. | Splivallo, Bossi, et al., 2007 | He; Program: 50C => 3C/min => 200C(10min) => 10C/min => 290C(10min) |

References

Pimerzin, Nesterova, et al., 1985
Pimerzin, a.A.; Nesterova, T.N.; Rozhnov, A.M.,
Equilibria of isomeric transformations and relations between thermodynamic properties of secondary alkylbenzenes,
J. Chem. Thermodyn., 1985, 17, 641-648. [all data]
Nesterova, Pimerzin, et al., 1984
Nesterova, T.N.; Pimerzin, A.A.; Rozhnov, A.M.; Roshchupkina, I.Ya.,
Thermodynamics of aromatic hydrocarbons,
Probl. Kalorim. Khim. Termodin., Dokl. Vses. Konf., 10th, 1984, 1, 225-227. [all data]
Pimerzin, Nesterova, et al., 1986
Pimerzin, A.A.; Nesterova, T.N.; Rozhnov, A.M.,
Equilibria of isomeric transformations and relations between thermodynamic properties of secondary alkylbenzenes,
J. Chem. Thermodyn., 1986, 17, 641-648. [all data]
Schomburg, 1966
Schomburg, G.,
Gaschromatographische Retentionsdaten und struktur chemischer verbindungen. III. Alkylverzweigte und ungesättigte cyclische Kohlenwasserstoffe,
J. Chromatogr., 1966, 23, 18-41, https://doi.org/10.1016/S0021-9673(01)98653-4
. [all data]
Splivallo, Bossi, et al., 2007
Splivallo, R.; Bossi, S.; Maffei, M.; Bonfante, P.,
Discrimination of truffle fruiting body versus mycelial aromas by stir bar sorptive extraction,
Phytochemistry, 2007, 68, 20, 2584-2598, https://doi.org/10.1016/j.phytochem.2007.03.030
. [all data]