(3-Heptyl)benzene
- Formula: C13H20
- Molecular weight: 176.2979
- IUPAC Standard InChIKey: QXZANYPVYZTYBN-UHFFFAOYSA-N
- CAS Registry Number: 2132-85-6
- Chemical structure:
View 3d structure (requires JavaScript / HTML 5) - Species with the same structure:

Reaction thermochemistry data

Data compiled by: Hussein Y. Afeefy, Joel F. Liebman, and Stephen E. Stein
Individual Reactions
By formula: C13H20 = C13H20
Quantity | Value | Units | Method | Reference | Comment |
---|---|---|---|---|---|
ΔrH° | 0.21 ± 0.07 | kJ/mol | Eqk | Pimerzin, Nesterova, et al., 1986 | liquid phase |
ΔrH° | -0.21 ± 0.07 | kJ/mol | Eqk | Pimerzin, Nesterova, et al., 1985 | liquid phase; AlCl3 |
ΔrH° | -0.21 ± 0.07 | kJ/mol | Eqk | Nesterova, Pimerzin, et al., 1984 | liquid phase; At 319.2 K, see Pimerzin, Nesterova, et al., 1985, see Pimerzin, Nesterova, et al., 1986 |
By formula: C13H20 = C13H20
Quantity | Value | Units | Method | Reference | Comment |
---|---|---|---|---|---|
ΔrH° | 0.02 ± 0.41 | kJ/mol | Eqk | Pimerzin, Nesterova, et al., 1985 | liquid phase; AlCl3 |
ΔrH° | 0.02 ± 0.41 | kJ/mol | Eqk | Nesterova, Pimerzin, et al., 1984 | liquid phase; At 321.4 K, see Pimerzin, Nesterova, et al., 1985, see Pimerzin, Nesterova, et al., 1986 |
By formula: C13H20 = C13H20
Quantity | Value | Units | Method | Reference | Comment |
---|---|---|---|---|---|
ΔrH° | 0.02 ± 0.41 | kJ/mol | Eqk | Pimerzin, Nesterova, et al., 1986 | liquid phase; GLC |

References

Pimerzin, Nesterova, et al., 1986
Pimerzin, A.A.; Nesterova, T.N.; Rozhnov, A.M.,
Equilibria of isomeric transformations and relations between thermodynamic properties of secondary alkylbenzenes,
J. Chem. Thermodyn., 1986, 17, 641-648. [all data]
Pimerzin, Nesterova, et al., 1985
Pimerzin, a.A.; Nesterova, T.N.; Rozhnov, A.M.,
Equilibria of isomeric transformations and relations between thermodynamic properties of secondary alkylbenzenes,
J. Chem. Thermodyn., 1985, 17, 641-648. [all data]
Nesterova, Pimerzin, et al., 1984
Nesterova, T.N.; Pimerzin, A.A.; Rozhnov, A.M.; Roshchupkina, I.Ya.,
Thermodynamics of aromatic hydrocarbons,
Probl. Kalorim. Khim. Termodin., Dokl. Vses. Konf., 10th, 1984, 1, 225-227. [all data]