Benzene, (1-methylhexyl)-
- Formula: C13H20
- Molecular weight: 176.2979
- IUPAC Standard InChIKey: CAEGRAMHTMWFPP-UHFFFAOYSA-N
- CAS Registry Number: 2132-84-5
- Chemical structure:
View 3d structure (requires JavaScript / HTML 5) - Other names: Heptane, 2-phenyl-; (1-Methylhexyl)benzene

Reaction thermochemistry data

Data compiled by: Hussein Y. Afeefy, Joel F. Liebman, and Stephen E. Stein
Individual Reactions
By formula: C13H20 = C13H20
Quantity | Value | Units | Method | Reference | Comment |
---|---|---|---|---|---|
ΔrH° | 0.21 ± 0.07 | kJ/mol | Eqk | Pimerzin, Nesterova, et al., 1986 | liquid phase |
ΔrH° | -0.21 ± 0.07 | kJ/mol | Eqk | Pimerzin, Nesterova, et al., 1985 | liquid phase; AlCl3 |
ΔrH° | -0.21 ± 0.07 | kJ/mol | Eqk | Nesterova, Pimerzin, et al., 1984 | liquid phase; At 319.2 K, see Pimerzin, Nesterova, et al., 1985, see Pimerzin, Nesterova, et al., 1986 |
By formula: C13H20 = C13H20
Quantity | Value | Units | Method | Reference | Comment |
---|---|---|---|---|---|
ΔrH° | 0.02 ± 0.41 | kJ/mol | Eqk | Pimerzin, Nesterova, et al., 1986 | liquid phase; GLC |

Kovats' RI, non-polar column, isothermal

Column type | Active phase | Temperature (C) | I | Reference | Comment |
---|---|---|---|---|---|
Capillary | Apiezon | 150. | 1300. | Schomburg, 1966 | |
Capillary | Apiezon | 200. | 1320. | Schomburg, 1966 |

Normal alkane RI, non-polar column, isothermal

Column type | Active phase | Temperature (C) | I | Reference | Comment |
---|---|---|---|---|---|
Capillary | Squalane | 130. | 1281. | Papazova and Pankova, 1975 | N2; Column length: 100. m; Column diameter: 0.25 mm |

Normal alkane RI, non-polar column, temperature ramp

Column type | Active phase | I | Reference | Comment |
---|---|---|---|---|
Capillary | OV-101 | 1354. | Stern, Flath, et al., 1985 | 50. C @ 0.1 min, 4. K/min, 225. C @ 30. min; Column length: 50. m; Column diameter: 0.32 mm |

References

Pimerzin, Nesterova, et al., 1986
Pimerzin, A.A.; Nesterova, T.N.; Rozhnov, A.M.,
Equilibria of isomeric transformations and relations between thermodynamic properties of secondary alkylbenzenes,
J. Chem. Thermodyn., 1986, 17, 641-648. [all data]
Pimerzin, Nesterova, et al., 1985
Pimerzin, a.A.; Nesterova, T.N.; Rozhnov, A.M.,
Equilibria of isomeric transformations and relations between thermodynamic properties of secondary alkylbenzenes,
J. Chem. Thermodyn., 1985, 17, 641-648. [all data]
Nesterova, Pimerzin, et al., 1984
Nesterova, T.N.; Pimerzin, A.A.; Rozhnov, A.M.; Roshchupkina, I.Ya.,
Thermodynamics of aromatic hydrocarbons,
Probl. Kalorim. Khim. Termodin., Dokl. Vses. Konf., 10th, 1984, 1, 225-227. [all data]
Schomburg, 1966
Schomburg, G.,
Gaschromatographische Retentionsdaten und struktur chemischer verbindungen. III. Alkylverzweigte und ungesättigte cyclische Kohlenwasserstoffe,
J. Chromatogr., 1966, 23, 18-41, https://doi.org/10.1016/S0021-9673(01)98653-4
. [all data]
Papazova and Pankova, 1975
Papazova, D.I.; Pankova, M.C.,
Identification of individual aromatic hydrocarbons in kerosene fraction (b.p. 150-250 °),
J. Chromatogr., 1975, 105, 2, 411-414, https://doi.org/10.1016/S0021-9673(01)82276-7
. [all data]
Stern, Flath, et al., 1985
Stern, D.J.; Flath, R.A.; Mon, T.R.; Teranishi, R.; Lundin, R.E.; Benson, M.E.,
Crude oleic acid volatiles,
J. Agric. Food Chem., 1985, 33, 2, 180-184, https://doi.org/10.1021/jf00062a005
. [all data]