4-Chlorophenyl isothiocyanate
- Formula: C7H4ClNS
- Molecular weight: 169.631
- IUPAC Standard InChIKey: MZZVFXMTZTVUFO-UHFFFAOYSA-N
- CAS Registry Number: 2131-55-7
- Chemical structure:
View 3d structure (requires JavaScript / HTML 5) - Other names: p-Chlorophenyl isothiocyanate; Benzene, 1-chloro-4-isothiocyanato-; Isothiocyanic acid, p-chlorophenyl ester; Isothiocyanic acid, 4-chlorophenyl ester; 1-Chloro-4-isothiocyanatobenzene; 4-Chlor-phenyl-isothiocyanat

Phase change data

Data compiled by: Robert L. Brown and Stephen E. Stein
Reduced pressure boiling point
Tboil (K) | Pressure (bar) | Reference |
---|---|---|
401. to 403. | 0.024 | Frinton Laboratories Inc., 1986 |

References

Frinton Laboratories Inc., 1986
Frinton Laboratories Inc.,
Catalog Number 11, Frinton Laboratories Inc., Vineland, NJ, 1986, 99. [all data]