Naphthalene, 1,3,5-trimethyl-
- Formula: C13H14
- Molecular weight: 170.2503
- IUPAC Standard InChIKey: IJEBSXFVVHGNQF-UHFFFAOYSA-N
- CAS Registry Number: 2131-39-7
- Chemical structure:
View 3d structure (requires JavaScript / HTML 5) - Other names: 1,3,5-Trimethylnaphthalene

Phase change data

Data compiled by: Thermodynamics Research Center, NIST Boulder Laboratories, Chris Muzny director
Quantity | Value | Units | Method | Reference | Comment |
---|---|---|---|---|---|
Tboil | 557.7 | K | N/A | Evans, Smith, et al., 1954 | Uncertainty assigned by TRC = 3. K |
Quantity | Value | Units | Method | Reference | Comment |
Tfus | 318.65 | K | N/A | Luther and Riechel, 1950 | Uncertainty assigned by TRC = 0.6 K |

Van Den Dool and Kratz RI, polar column, temperature ramp

Column type | Active phase | I | Reference | Comment |
---|---|---|---|---|
Capillary | Supelcowax-10 | 2183. | Chung, 1999 | 60. m/0.25 mm/0.25 μm, He, 35. C @ 5. min, 2. K/min, 195. C @ 90. min |

Normal alkane RI, non-polar column, temperature ramp

Column type | Active phase | I | Reference | Comment |
---|---|---|---|---|
Capillary | OV-1 | 1578. | Asif and Fazeelat, 2006 | Nitrogen, 4. K/min; Column length: 30. m; Column diameter: 0.25 mm; Tstart: 60. C; Tend: 290. C |

Lee's RI, non-polar column, temperature ramp

Column type | Active phase | I | Reference | Comment |
---|---|---|---|---|
Capillary | DB-5 | 264.30 | Wang, Fingas, et al., 1994 | 30. m/0.32 mm/0.25 μm, He, 50. C @ 2. min, 6. K/min; Tend: 300. C |
Capillary | CP Sil 8 CB | 264.7 | Bundt, Herbel, et al., 1991 | 50. m/0.25 mm/0.25 μm, He, 4. K/min; Tstart: 80. C; Tend: 300. C |
Capillary | DB-5 | 262.72 | Forster, Alexander, et al., 1989 | H2, 2. K/min, 300. C @ 10. min; Column length: 60. m; Column diameter: 0.20 mm; Tstart: 70. C |

Lee's RI, non-polar column, custom temperature program

Column type | Active phase | I | Reference | Comment |
---|---|---|---|---|
Capillary | CP Sil 8 CB | 262.7 | Bundt, Herbel, et al., 1991 | 50. m/0.25 mm/0.25 μm, He; Program: not specified |
Capillary | CP Sil 8 CB | 264.0 | Bundt, Herbel, et al., 1991 | 50. m/0.25 mm/0.25 μm, He; Program: not specified |

References

Evans, Smith, et al., 1954
Evans, R.F.; Smith, J.C.; Strauss, F.B.,
Alkylnaphthalenes: x 1:4-dimethylnaphthalene and some trialkylnaphthalenes,
J. Inst. Pet., 1954, 40, 7. [all data]
Luther and Riechel, 1950
Luther, H.; Riechel, C.,
The Raman Spectra of Polymethylnphthalenes,
Z. Phys. Chem. (Leipzig), 1950, 195, 103. [all data]
Chung, 1999
Chung, H.Y.,
Volatile components in crabmeats of Charybdis feriatus,
J. Agric. Food Chem., 1999, 47, 6, 2280-2287, https://doi.org/10.1021/jf981027t
. [all data]
Asif and Fazeelat, 2006
Asif, M.; Fazeelat, T.,
Characterization of aromatic hydrocarbons in Dhurnal oil from Northen Indus Basin,
J. Chem. Soc. Pakistan, 2006, 28, 2, 169-175. [all data]
Wang, Fingas, et al., 1994
Wang, Z.; Fingas, M.; Li, K.,
Fractionation of a light crude oil and identification and quantitation of aliphatic, aromatic, and biomarker comopunds by GC-FID and GC-MS, Part II,
J. Chromatogr. Sci., 1994, 32, 9, 367-382, https://doi.org/10.1093/chromsci/32.9.367
. [all data]
Bundt, Herbel, et al., 1991
Bundt, J.; Herbel, W.; Steinhart, H.; Franke, S.; Francke, W.,
Structure-type separation of diesel fuels by solid phase extraction and identification of the two- and three-ring aromatics by capillary GC-mass spectrometry,
J. Hi. Res. Chromatogr., 1991, 14, 2, 91-98, https://doi.org/10.1002/jhrc.1240140205
. [all data]
Forster, Alexander, et al., 1989
Forster, P.G.; Alexander, R.; Kagi, R.I.,
Identification and analysis of tetramethylnaphthalenes in petroleum,
J. Chromatogr., 1989, 483, 384-389, https://doi.org/10.1016/S0021-9673(01)93138-3
. [all data]