1,1,1-Trifluoro-2-phenylethane
- Formula: C8H7F3
- Molecular weight: 160.1364
- IUPAC Standard InChIKey: AVSVJSGDSPDFLH-UHFFFAOYSA-N
- CAS Registry Number: 21249-93-4
- Chemical structure:
View 3d structure (requires JavaScript / HTML 5) - Species with the same structure:

Gas phase thermochemistry data

Data compiled by: Hussein Y. Afeefy, Joel F. Liebman, and Stephen E. Stein
Quantity | Value | Units | Method | Reference | Comment |
---|---|---|---|---|---|
ΔfH°gas | -623.85 ± 0.88 | kJ/mol | Ccr | Schaffer, Verevkin, et al., 1997 |

Condensed phase thermochemistry data

Data compiled by: Hussein Y. Afeefy, Joel F. Liebman, and Stephen E. Stein
Quantity | Value | Units | Method | Reference | Comment |
---|---|---|---|---|---|
ΔfH°liquid | -669.95 ± 0.84 | kJ/mol | Ccr | Schaffer, Verevkin, et al., 1997 | |
Quantity | Value | Units | Method | Reference | Comment |
ΔcH°liquid | -4016.36 | kJ/mol | Ccr | Schaffer, Verevkin, et al., 1997 |

Phase change data

Data compiled as indicated in comments:
ALS - Hussein Y. Afeefy, Joel F. Liebman, and Stephen E. Stein
AC - William E. Acree, Jr., James S. Chickos
Quantity | Value | Units | Method | Reference | Comment |
---|---|---|---|---|---|
ΔvapH° | 46.10 ± 0.25 | kJ/mol | V | Schaffer, Verevkin, et al., 1997 | ALS |
ΔvapH° | 46.1 ± 0.3 | kJ/mol | GS | Schaffer, Verevkin, et al., 1997 | Based on data from 273. to 313. K.; AC |

References

Schaffer, Verevkin, et al., 1997
Schaffer, F.; Verevkin, S.P.; Rieger, H.J.; Beckhaus, H.D.; Ruchardt, C.,
Enthalpies of formation of a series of fluorinated hydrocarbons and strain-free group increments to assess polar and anomeric stabilization and strain,
Liebigs Ann., 1997, 1333-1344. [all data]