2,4-Dichloro-1-vinylbenzene
- Formula: C8H6Cl2
- Molecular weight: 173.039
- IUPAC Standard InChIKey: OMNYXCUDBQKCMU-UHFFFAOYSA-N
- CAS Registry Number: 2123-27-5
- Chemical structure:
View 3d structure (requires JavaScript / HTML 5) - Other names: 2,4-dichlorostyrene

Phase change data

Data compiled by: William E. Acree, Jr., James S. Chickos
Enthalpy of vaporization
ΔvapH (kJ/mol) | Temperature (K) | Method | Reference | Comment |
---|---|---|---|---|
55.0 | 342. | A | Stephenson and Malanowski, 1987 | Based on data from 327. to 498. K. See also Dykyj and Vanko, 1970. |

References

Stephenson and Malanowski, 1987
Stephenson, Richard M.; Malanowski, Stanislaw,
Handbook of the Thermodynamics of Organic Compounds, 1987, https://doi.org/10.1007/978-94-009-3173-2
. [all data]
Dykyj and Vanko, 1970
Dykyj, J.; Vanko, A.,
Petrochemica, 1970, 10, 1, 3. [all data]