Ethynyl radical
- Formula: C2H
- Molecular weight: 25.0293
- IUPAC Standard InChIKey: XEHVFKKSDRMODV-UHFFFAOYSA-N
- CAS Registry Number: 2122-48-7
- Chemical structure:
View 3d structure (requires JavaScript / HTML 5) - Permanent link for this species. Use this link for bookmarking this species for future reference.

Gas phase thermochemistry data

Quantity | Value | Units | Method | Reference | Comment |
---|---|---|---|---|---|
ΔfH°gas | 476.98 | kJ/mol | Review | Chase, 1998 | Data last reviewed in March, 1967 |
ΔfH°gas | 556. ± 8. | kJ/mol | N/A | Tsang, 1996 | |
Quantity | Value | Units | Method | Reference | Comment |
S°gas,1 bar | 207.44 | J/mol*K | Review | Chase, 1998 | Data last reviewed in March, 1967 |
Gas Phase Heat Capacity (Shomate Equation)
Cp° = A + B*t + C*t2 + D*t3 +
E/t2
H° − H°298.15= A*t + B*t2/2 +
C*t3/3 + D*t4/4 − E/t + F − H
S° = A*ln(t) + B*t + C*t2/2 + D*t3/3 −
E/(2*t2) + G
Cp = heat capacity (J/mol*K)
H° = standard enthalpy (kJ/mol)
S° = standard entropy (J/mol*K)
t = temperature (K) / 1000.
View plot Requires a JavaScript / HTML 5 canvas capable browser.
Temperature (K) | 298. to 1200. | 1200. to 6000. |
---|---|---|
A | 33.40916 | 39.29220 |
B | 24.11331 | 13.32081 |
C | -6.600595 | -1.952364 |
D | 0.278912 | 0.086290 |
E | -0.259459 | 0.978203 |
F | 465.1311 | 464.3027 |
G | 239.5148 | 248.5949 |
H | 476.9760 | 476.9760 |
Reference | Chase, 1998 | Chase, 1998 |
Comment | Data last reviewed in March, 1967 | Data last reviewed in March, 1967 |

Reaction thermochemistry data

Data compiled by: John E. Bartmess
Individual Reactions
(C2H2- • 4294967295) +
= C2H2-
By formula: (C2H2- • 4294967295C2H) + C2H = C2H2-
Quantity | Value | Units | Method | Reference | Comment |
---|---|---|---|---|---|
ΔrH° | 328. ± 15. | kJ/mol | N/A | Ervin, Gronert, et al., 1990 | gas phase; Vinylidene neutral: ΔHf<=99±2 kcal, Kiefer, Sidhu, et al., 1989 |
ΔrH° | 187. ± 14. | kJ/mol | Ther | Guo and Grabowski, 1990 | gas phase; Between PhF, Me3P |

Gas phase ion energetics data

Data evaluated as indicated in comments:
HL - Edward P. Hunter and Sharon G. Lias
L - Sharon G. Lias
Data compiled as indicated in comments:
B - John E. Bartmess
LL - Sharon G. Lias and Joel F. Liebman
LLK - Sharon G. Lias, Rhoda D. Levin, and Sherif A. Kafafi
Quantity | Value | Units | Method | Reference | Comment |
---|---|---|---|---|---|
IE (evaluated) | 11.61 ± 0.07 | eV | N/A | N/A | L |
Quantity | Value | Units | Method | Reference | Comment |
Proton affinity (review) | 180. | kcal/mol | N/A | Hunter and Lias, 1998 | HL |
Quantity | Value | Units | Method | Reference | Comment |
Gas basicity | 172.3 | kcal/mol | N/A | Hunter and Lias, 1998 | HL |
Electron affinity determinations
EA (eV) | Method | Reference | Comment |
---|---|---|---|
2.9689 ± 0.0011 | N/A | Zhou, Garand, et al., 2007 | B |
2.9690 ± 0.0060 | LPES | Ervin and Lineberger, 1991 | B |
2.956 ± 0.020 | LPES | Taylor, Xu, et al., 1998 | B |
2.94 ± 0.10 | LPD | Janousek, Brauman, et al., 1979 | Adiabatic EA: 3.18±0.25 eV; B |
>2.30 ± 0.70 | EIAE | Thynne and MacNiel, 1971 | From C2H4; B |
3.730 ± 0.050 | PD | Feldman, 1970 | B |
2.10 ± 0.30 | EIAE | Locht and Momigny, 1970 | From C2H2, C2H4; B |
>2.79998 | EIAE | Trepka and Neuert, 1963 | From C2H4; B |
2.64955 | SI | Page and Goode, 1969 | The Magnetron method, lacking mass analysis, is not considered reliable.; B |
Ionization energy determinations
IE (eV) | Method | Reference | Comment |
---|---|---|---|
11.61 ± 0.07 | DER | Norwood and Ng, 1989 | LL |
11.7 | DER | Lias, Bartmess, et al., 1988 | LL |
11.31 ± 0.13 | DER | Ono and Ng, 1981 | LLK |
11.51 | DER | Ono and Ng, 1981 | Unpublished result of S.I.Miller and J.Berkowitz; LLK |
11.96 ± 0.05 | DER | Okabe and Dibeler, 1973 | LLK |
11.96 ± 0.05 | DER | Dibeler, Walker, et al., 1973 | LLK |
11.6 ± 0.5 | EI | Wyatt and Stafford, 1972 | LLK |
Anion protonation reactions
C2H- + =
Quantity | Value | Units | Method | Reference | Comment |
---|---|---|---|---|---|
ΔrH° | 379. ± 5. | kcal/mol | AVG | N/A | Average of 8 values; Individual data points |
Quantity | Value | Units | Method | Reference | Comment |
ΔrG° | 370. ± 5. | kcal/mol | AVG | N/A | Average of 7 values; Individual data points |

Ion clustering data

Data compiled by: John E. Bartmess
Clustering reactions
(C2H2- • 4294967295) +
= C2H2-
By formula: (C2H2- • 4294967295C2H) + C2H = C2H2-
Quantity | Value | Units | Method | Reference | Comment |
---|---|---|---|---|---|
ΔrH° | 78.5 ± 3.6 | kcal/mol | N/A | Ervin, Gronert, et al., 1990 | gas phase; Vinylidene neutral: ΔHf<=99±2 kcal, Kiefer, Sidhu, et al., 1989 |
ΔrH° | 44.6 ± 3.3 | kcal/mol | Ther | Guo and Grabowski, 1990 | gas phase; Between PhF, Me3P |

References

Chase, 1998
Chase, M.W., Jr.,
NIST-JANAF Themochemical Tables, Fourth Edition,
J. Phys. Chem. Ref. Data, Monograph 9, 1998, 1-1951. [all data]
Tsang, 1996
Tsang, W.,
Heats of Formation of Organic Free Radicals by Kinetic Methods
in Energetics of Organic Free Radicals, Martinho Simoes, J.A.; Greenberg, A.; Liebman, J.F., eds., Blackie Academic and Professional, London, 1996, 22-58. [all data]
Ervin, Gronert, et al., 1990
Ervin, K.M.; Gronert, S.; Barlow, S.E.; Gilles, M.K.; Harrison, A.G.; Bierbaum, V.M.; DePuy, C.H.; Lin, W.C.,
Bonds Strengths of Ethylene and Acetylene,
J. Am. Chem. Soc., 1990, 112, 15, 5750, https://doi.org/10.1021/ja00171a013
. [all data]
Kiefer, Sidhu, et al., 1989
Kiefer, J.H.; Sidhu, S.S.; Kumaran, S.S.; Irdan, E.A.,
RRKM Model of C2H4 Dissociation: Heat of Formation of Vinylidene,
Chem. Phys. Lett., 1989, 159, 1, 32, https://doi.org/10.1016/S0009-2614(89)87448-2
. [all data]
Guo and Grabowski, 1990
Guo, Y.; Grabowski, J.J.,
Gas Phase Ion Chemistry of the Vinylidene Radical Anion and the Acidity of the Vinyl Radical,
Int. J. Mass Spectrom. Ion Proc., 1990, 97, 3, 253, https://doi.org/10.1016/0168-1176(90)85003-K
. [all data]