Triphenyl vinyl tin
- Formula: C20H18Sn
- Molecular weight: 377.067
- IUPAC Standard InChIKey: JCJXEBAQTMCZGK-UHFFFAOYSA-N
- CAS Registry Number: 2117-48-8
- Chemical structure:
View 3d structure (requires JavaScript / HTML 5) - Permanent link for this species. Use this link for bookmarking this species for future reference.

Gas phase thermochemistry data

Data compiled by: José A. Martinho Simões
Quantity | Value | Units | Method | Reference | Comment |
---|---|---|---|---|---|
ΔfH°gas | 528.6 ± 7.1 | kJ/mol | Review | Martinho Simões |

Condensed phase thermochemistry data

Data compiled as indicated in comments:
MS - José A. Martinho Simões
DH - Eugene S. Domalski and Elizabeth D. Hearing
Quantity | Value | Units | Method | Reference | Comment |
---|---|---|---|---|---|
ΔfH°solid | 414.5 ± 6.6 | kJ/mol | Review | Martinho Simões | MS |
Quantity | Value | Units | Method | Reference | Comment |
ΔcH°solid | -11434.8 ± 6.1 | kJ/mol | CC-SB | Carson, Laye, et al., 1985 | MS |
Constant pressure heat capacity of solid
Cp,solid (J/mol*K) | Temperature (K) | Reference | Comment |
---|---|---|---|
486.4 | 298.15 | Carson, Laye, et al., 1985, 2 | Cp given as 1.29 J/g*K.; DH |

Phase change data

Data compiled by: José A. Martinho Simões
Quantity | Value | Units | Method | Reference | Comment |
---|---|---|---|---|---|
ΔsubH° | 114.1 ± 2.5 | kJ/mol | CC-SB | Carson, Laye, et al., 1985 |

References

Martinho Simões
Martinho Simões, J.A.,
Private communication (see http://webbook.nist.gov/chemistry/om/). [all data]
Carson, Laye, et al., 1985
Carson, A.S.; Laye, P.G.; Spencer, J.A.,
J. Chem. Thermodyn., 1985, 17, 277. [all data]
Carson, Laye, et al., 1985, 2
Carson, A.S.; Laye, P.G.; Spencer, J.A.,
The enthalpies of formation of triphenyl vinyl tin and triphenyl phenylethynyl tin and some associated tin-carbon bond enthalpies,
J. Chem. Thermodynam., 1985, 17, 277-281. [all data]