4-Pentyn-2-ol
- Formula: C5H8O
- Molecular weight: 84.1164
- IUPAC Standard InChIKey: JTHLRRZARWSHBE-UHFFFAOYSA-N
- CAS Registry Number: 2117-11-5
- Chemical structure:
View 3d structure (requires JavaScript / HTML 5) - Other names: 4-Pentyne-2-ol; pent-4-yn-2-ol

Phase change data

Data compiled as indicated in comments:
BS - Robert L. Brown and Stephen E. Stein
TRC - Thermodynamics Research Center, NIST Boulder Laboratories, Chris Muzny director
Quantity | Value | Units | Method | Reference | Comment |
---|---|---|---|---|---|
Tboil | 399.7 | K | N/A | Aldrich Chemical Company Inc., 1990 | BS |
Tboil | 399. | K | N/A | Farchan Laboratories, 1990 | BS |
Tboil | 300.45 | K | N/A | Pomerantz, Fookson, et al., 1954 | Uncertainty assigned by TRC = 0.5 K; TRC |

Gas phase ion energetics data

Data compiled by: Sharon G. Lias, Rhoda D. Levin, and Sherif A. Kafafi
Ionization energy determinations
IE (eV) | Method | Reference | Comment |
---|---|---|---|
10.24 | PE | Andreocci, Bitchev, et al., 1979 | Vertical value |

References

Aldrich Chemical Company Inc., 1990
Aldrich Chemical Company Inc.,
Catalog Handbook of Fine Chemicals, Aldrich Chemical Company, Inc., Milwaukee WI, 1990, 1. [all data]
Farchan Laboratories, 1990
Farchan Laboratories,
Research Chemicals Catalog, Farchan Laboratories, Gainesville, FL, 1990, 91. [all data]
Pomerantz, Fookson, et al., 1954
Pomerantz, P.; Fookson, A.; Mears, T.W.; Rothberg, S.; Howard, F.L.,
Synthesis and Physical Properties of Several Acetylenic Hydrocarbons,
J. Res. Natl. Bur. Stand. (U. S.), 1954, 52, 51. [all data]