Pyridine, 4-benzyl-
- Formula: C12H11N
- Molecular weight: 169.2224
- IUPAC Standard InChIKey: DBOLXXRVIFGDTI-UHFFFAOYSA-N
- CAS Registry Number: 2116-65-6
- Chemical structure:
View 3d structure (requires JavaScript / HTML 5) - Other names: Pyridine, 4-(phenylmethyl)-; γ-Benzylpyridine; Ba 33216; 4-Benzylpyridine

Phase change data

Data compiled by: Robert L. Brown and Stephen E. Stein
Quantity | Value | Units | Method | Reference | Comment |
---|---|---|---|---|---|
Tboil | 560.2 | K | N/A | Aldrich Chemical Company Inc., 1990 |
Reduced pressure boiling point
Tboil (K) | Pressure (bar) | Reference |
---|---|---|
560.2 | 0.989 | Weast and Grasselli, 1989 |
453.7 | 0.041 | Weast and Grasselli, 1989 |
560. | 0.989 | Buckingham and Donaghy, 1982 |
453. to 454. | 0.041 | Buckingham and Donaghy, 1982 |

References

Aldrich Chemical Company Inc., 1990
Aldrich Chemical Company Inc.,
Catalog Handbook of Fine Chemicals, Aldrich Chemical Company, Inc., Milwaukee WI, 1990, 1. [all data]
Weast and Grasselli, 1989
CRC Handbook of Data on Organic Compounds, 2nd Editon, Weast,R.C and Grasselli, J.G., ed(s)., CRC Press, Inc., Boca Raton, FL, 1989, 1. [all data]
Buckingham and Donaghy, 1982
Buckingham, J.; Donaghy, S.M.,
Dictionary of Organic Compounds: Fifth Edition, Chapman and Hall, New York, 1982, 1. [all data]