Dimethyl(8-quinolinolato)gold

Phase change data

Data compiled by: William E. Acree, Jr., James S. Chickos

Enthalpy of sublimation

ΔsubH (kJ/mol) Temperature (K) Method Reference
121.2 ± 1.9353. - 388.MEBessonov, Morozova, et al., 2008

References

Bessonov, Morozova, et al., 2008
Bessonov, A.A.; Morozova, N.B.; Semyannikov, P.P.; Trubin, S.V.; Gel'fond, N.V.; Igumenov, I.K., Thermal properties of dimethylgold(III) 8-hydroxyquinolinate and 8-mercaptoquinolinate, Russ J Coord Chem, 2008, 34, 3, 186-189, https://doi.org/10.1134/S1070328408030068 . [all data]