Cyclohexane, 2-propenyl-
- Formula: C9H16
- Molecular weight: 124.2233
- IUPAC Standard InChIKey: KVOZXXSUSRZIKD-UHFFFAOYSA-N
- CAS Registry Number: 2114-42-3
- Chemical structure:
View 3d structure (requires JavaScript / HTML 5) - Other names: Cyclohexane, allyl-; Allylcyclohexane; 1-Cyclohexyl-2-propene; 1-Propene, 3-cyclohexyl-; 3-Cyclohexyl-1-propene

Condensed phase thermochemistry data

Data compiled by: Eugene S. Domalski and Elizabeth D. Hearing
Constant pressure heat capacity of liquid
Cp,liquid (J/mol*K) | Temperature (K) | Reference |
---|---|---|
233.5 | 298.15 | Fuchs and Peacock, 1979 |

Phase change data

Data compiled as indicated in comments:
TRC - Thermodynamics Research Center, NIST Boulder Laboratories, Chris Muzny director
ALS - Hussein Y. Afeefy, Joel F. Liebman, and Stephen E. Stein
AC - William E. Acree, Jr., James S. Chickos
Quantity | Value | Units | Method | Reference | Comment |
---|---|---|---|---|---|
Tboil | 400.23 | K | N/A | Anonymous, 1952 | Uncertainty assigned by TRC = 0.15 K; TRC |
Tboil | 422. | K | N/A | Hurd and Bollman, 1933 | Uncertainty assigned by TRC = 4. K; TRC |
Quantity | Value | Units | Method | Reference | Comment |
ΔvapH° | 44.0 ± 0.3 | kJ/mol | C | Fuchs and Peacock, 1979 | ALS |
ΔvapH° | 44.0 ± 0.2 | kJ/mol | GCC | Fuchs and Peacock, 1979 | AC |

Kovats' RI, non-polar column, isothermal

Column type | Active phase | Temperature (C) | I | Reference | Comment |
---|---|---|---|---|---|
Capillary | OV-101 | 100. | 926. | Engewald, Topalova, et al., 1987 | Column length: 50. m; Column diameter: 0.30 mm |
Capillary | OV-1 | 100. | 925.9 | Anders, Anders, et al., 1985 | 55. m/0.21 mm/0.35 μm, N2 |
Capillary | SE-30 | 130. | 935. | Bredael, 1982 | Column length: 100. m; Column diameter: 0.5 mm |
Capillary | SE-30 | 80. | 919. | Bredael, 1982 | Column length: 100. m; Column diameter: 0.5 mm |
Capillary | Squalane | 86. | 921.0 | Nabivach, Bur'yan, et al., 1978 | Column length: 50. m; Column diameter: 0.25 mm |
Capillary | Squalane | 96. | 922.5 | Nabivach, Bur'yan, et al., 1978 | Column length: 50. m; Column diameter: 0.25 mm |

Normal alkane RI, non-polar column, custom temperature program

Column type | Active phase | I | Reference | Comment |
---|---|---|---|---|
Capillary | Squalane | 919. | Chen, 2008 | Program: not specified |
Capillary | Methyl Silicone | 918. | Zenkevich, 1996 | Program: not specified |
Capillary | Methyl Silicone | 918. | Zenkevich, 1995 | Program: not specified |

References

Fuchs and Peacock, 1979
Fuchs, R.; Peacock, L.A.,
Heats of vaporization and gaseous heats of formation of some five- and six-membered ring alkenes,
Can. J. Chem., 1979, 57, 2302-2304. [all data]
Anonymous, 1952
Anonymous, R.,
, Physical Properties of Chemical Substances, Dow Chemical Co., 1952. [all data]
Hurd and Bollman, 1933
Hurd, C.D.; Bollman, H.T.,
The Pyrolysis of Alpha Unsaturated Hydrocarbons,
J. Am. Chem. Soc., 1933, 55, 699-702. [all data]
Engewald, Topalova, et al., 1987
Engewald, W.; Topalova, I.; Petsev, N.; Dimitrov, Chr.,
Structure-Retention Correlations of Hydrocarbons in GLC and GSC. Alkenylbenzenes,
Chromatographia, 1987, 23, 8, 561-565, https://doi.org/10.1007/BF02324864
. [all data]
Anders, Anders, et al., 1985
Anders, G.; Anders, K.; Engewald, W.,
Identification of non-branched alkenylcycloalkanes with a terminal double bond from retention index increments,
Chromatographia, 1985, 20, 2, 83-86, https://doi.org/10.1007/BF02280602
. [all data]
Bredael, 1982
Bredael, P.,
Retention indices of hydrocarbons on SE-30,
J. Hi. Res. Chromatogr. Chromatogr. Comm., 1982, 5, 6, 325-328, https://doi.org/10.1002/jhrc.1240050610
. [all data]
Nabivach, Bur'yan, et al., 1978
Nabivach, V.M.; Bur'yan, P.; Matsak, I.,
Retention indices of aromatic hydrocarbons on a squalane capillary column,
Zh. Anal. Khim., 1978, 33, 7, 1108-1113. [all data]
Chen, 2008
Chen, H.-F.,
Quantitative prediction of gas chromatography retention indices with support vector machines, radial basis neutral networks and multiple linear regression,
Anal. Chim. Acta, 2008, 609, 1, 24-36, https://doi.org/10.1016/j.aca.2008.01.003
. [all data]
Zenkevich, 1996
Zenkevich, I.G.,
Informational Maitenance of Gas Chromatographic Identification of Organic Compounds in Ecoanalytical Investigations,
Z. Anal. Chem., 1996, 51, 11, 1140-1148. [all data]
Zenkevich, 1995
Zenkevich, I.G.,
Calculation of Gas-Chromatographic Retention Indices from Physico-Chemical Constants of Organic Compounds,
Z. Anal. Chem., 1995, 50, 10, 1048-1056. [all data]