1,1'-Biphenyl, 3-bromo-
- Formula: C12H9Br
- Molecular weight: 233.104
- IUPAC Standard InChIKey: USYQKCQEVBFJRP-UHFFFAOYSA-N
- CAS Registry Number: 2113-57-7
- Chemical structure:
View 3d structure (requires JavaScript / HTML 5) - Other names: Biphenyl, 3-bromo-; m-Bromobiphenyl; 3-Bromobiphenyl; 3-Bromo diphenyl

Phase change data

Data compiled by: Robert L. Brown and Stephen E. Stein
Quantity | Value | Units | Method | Reference | Comment |
---|---|---|---|---|---|
Tboil | 573.2 | K | N/A | Weast and Grasselli, 1989 | |
Tboil | 572. to 574. | K | N/A | Buckingham and Donaghy, 1982 |
Reduced pressure boiling point
Tboil (K) | Pressure (bar) | Reference |
---|---|---|
376.7 | 0.0003 | Aldrich Chemical Company Inc., 1990 |
384. | 0.001 | Buckingham and Donaghy, 1982 |

References

Weast and Grasselli, 1989
CRC Handbook of Data on Organic Compounds, 2nd Editon, Weast,R.C and Grasselli, J.G., ed(s)., CRC Press, Inc., Boca Raton, FL, 1989, 1. [all data]
Buckingham and Donaghy, 1982
Buckingham, J.; Donaghy, S.M.,
Dictionary of Organic Compounds: Fifth Edition, Chapman and Hall, New York, 1982, 1. [all data]
Aldrich Chemical Company Inc., 1990
Aldrich Chemical Company Inc.,
Catalog Handbook of Fine Chemicals, Aldrich Chemical Company, Inc., Milwaukee WI, 1990, 1. [all data]