Benzene, 2-(1,1-dimethylethyl)-1,4-dimethoxy-
- Formula: C12H18O2
- Molecular weight: 194.2701
- IUPAC Standard InChIKey: ALVJDUNBMKMTDC-UHFFFAOYSA-N
- CAS Registry Number: 21112-37-8
- Chemical structure:
View 3d structure (requires JavaScript / HTML 5) - Other names: Benzene, 2-tert-butyl-1,4-dimethoxy-; 3-t-Butyl-4-methoxyphenol methyl derivative; 1,4-Dimethoxy-2-tert-butylbenzene; 2-tert-Butyl-1,4-dimethoxybenzene; tert-Butylhydroquinone, dimethyl ether; Benzene, 1,4-dimethoxy-2-(1,1-dimethylethyl)

Van Den Dool and Kratz RI, non-polar column, custom temperature program

Column type | Active phase | I | Reference | Comment |
---|---|---|---|---|
Capillary | VF-5MS | 1425.4 | Tret'yakov, 2008 | 30. m/0.25 mm/0.25 μm, He; Program: Multi-step temperature program; T(initial)=60C; T(final)=270C |

Normal alkane RI, non-polar column, custom temperature program

Column type | Active phase | I | Reference | Comment |
---|---|---|---|---|
Capillary | 5 % Phenyl methyl siloxane | 1408. | Huang, Qin, et al., 2009 | 30. m/0.25 mm/0.25 μm, Helium; Program: 50 0C (2 min) 10 0C/min -> 150 0C 15 0C/min -> 300 0C (10 min) |
Capillary | SE-30 | 1398. | Vinogradov, 2004 | Program: not specified |

Normal alkane RI, polar column, custom temperature program

Column type | Active phase | I | Reference | Comment |
---|---|---|---|---|
Capillary | Carbowax 20M | 1870. | Vinogradov, 2004 | Program: not specified |

References

Tret'yakov, 2008
Tret'yakov, K.V.,
Retention Data. NIST Mass Spectrometry Data Center., NIST Mass Spectrometry Data Center, 2008. [all data]
Huang, Qin, et al., 2009
Huang, B.; Qin, L.; Chu, Q.; Zhang, Q.; Gao, L.; Zheng, H.,
Comparison of headspace SPME with hydrodistillation and SFE for analysis of the volatile components of the roots of Valeriana officinalis var. latifolia,
Chromatographia, 2009, 69, 5/6, 489-496, https://doi.org/10.1365/s10337-008-0921-y
. [all data]
Vinogradov, 2004
Vinogradov, B.A.,
Production, composition, properties and application of essential oils, 2004, retrieved from http://viness.narod.ru. [all data]