2-pentanol, 3-ethyl-4,4-dimethyl-
- Formula: C9H20O
- Molecular weight: 144.2545
- IUPAC Standard InChIKey: YGQDLQQRBCOMKJ-UHFFFAOYSA-N
- CAS Registry Number: 21102-09-0
- Chemical structure:
View 3d structure (requires JavaScript / HTML 5) - Permanent link for this species. Use this link for bookmarking this species for future reference.

Phase change data

Data compiled by: Thermodynamics Research Center, NIST Boulder Laboratories, Chris Muzny director
Quantity | Value | Units | Method | Reference | Comment |
---|---|---|---|---|---|
Tboil | 460.15 | K | N/A | Brannock, 1959 | Uncertainty assigned by TRC = 4. K |

References

Brannock, 1959
Brannock, K.C.,
Preparation of substituted 4-pentenals,
J. Am. Chem. Soc., 1959, 81, 3379. [all data]