4,5,5-trimethyl-3-hexanone
- Formula: C9H18O
- Molecular weight: 142.2386
- IUPAC Standard InChIKey: NIZGHKWTGTZAQQ-UHFFFAOYSA-N
- CAS Registry Number: 21101-97-3
- Chemical structure:
View 3d structure (requires JavaScript / HTML 5) - Permanent link for this species. Use this link for bookmarking this species for future reference.

Phase change data

Data compiled by: Thermodynamics Research Center, NIST Boulder Laboratories, Chris Muzny director
Quantity | Value | Units | Method | Reference | Comment |
---|---|---|---|---|---|
Tboil | 443. | K | N/A | Stehman, 1942 | Uncertainty assigned by TRC = 5. K |

References

Stehman, 1942
Stehman, C.J.,
, PhD Thesis, 1942. [all data]