Perhydroanthracene, (4aα, 8aα, 9aα, 10aβ)-
- Formula: C14H24
- Molecular weight: 192.3404
- IUPAC Standard InChIKey: GVJFFQYXVOJXFI-SYQHCUMBSA-N
- CAS Registry Number: 2109-05-9
- Chemical structure:
View 3d structure (requires JavaScript / HTML 5) - Species with the same structure:
- Stereoisomers:
- Anthracene, tetradecahydro-, (4aα,8aα,9aα,10aα)-
- trans-anti-trans-Tetra-decahydroanthracene
- Perhydroanthracene, (4aα, 8aβ, 9aα, 10aβ)-
- Anthracene, tetradecahydro-
- Tricyclo[8.4.0.0(3,8)]dodecane, isomer # 1
- Tricyclo[8.4.0.0(3,8)]dodecane, isomer # 2
- Tricyclo[8.4.0.0(3,8)]dodecane, isomer # 3
- Tricyclo[8.4.0.0(3,8)]dodecane, isomer # 4
- Tricyclo[8.4.0.0(3,8)]dodecane, isomer # 5
- Other names: cis,trans-Perhydroanthracene (4aα,8aα,9aα,10aβ)

Gas phase thermochemistry data

Data compiled by: Glushko Thermocenter, Russian Academy of Sciences, Moscow
Constant pressure heat capacity of gas
Cp,gas (J/mol*K) | Temperature (K) | Reference | Comment |
---|---|---|---|
48.65 | 50. | Dorofeeva O.V., 1988 | Recommended values were calculated statistically mechanically using force field approximation for polycyclic aromatic hydrocarbons to estimate the needed vibrational frequencies (see also [ Dorofeeva O.V., 1986]). These functions are reproduced in the reference book [ Frenkel M., 1994]. |
79.22 | 100. | ||
113.21 | 150. | ||
148.86 | 200. | ||
209.15 | 273.15 | ||
231.7 ± 3.5 | 298.15 | ||
233.42 | 300. | ||
325.56 | 400. | ||
409.51 | 500. | ||
480.66 | 600. | ||
540.14 | 700. | ||
590.06 | 800. | ||
632.24 | 900. | ||
668.05 | 1000. | ||
698.56 | 1100. | ||
724.65 | 1200. | ||
747.01 | 1300. | ||
766.26 | 1400. | ||
782.88 | 1500. |

Reaction thermochemistry data

Data compiled by: Hussein Y. Afeefy, Joel F. Liebman, and Stephen E. Stein
Individual Reactions
By formula: C14H24 = C14H24
Quantity | Value | Units | Method | Reference | Comment |
---|---|---|---|---|---|
ΔrH° | -2.79 ± 0.28 | kcal/mol | Eqk | Allinger and Wuesthoff, 1971 | gas phase |
ΔrH° | -8.74 ± 0.61 | kcal/mol | Eqk | Allinger and Wuesthoff, 1971 | gas phase |

References

Dorofeeva O.V., 1988
Dorofeeva O.V.,
Thermodynamic Properties of Polycyclic Aromatic Hydrocarbons in the Gaseous Phase. Institute for High Temperatures, USSR Academy of Sciences, Preprint No.1-238 (in Russian), Moscow, 1988. [all data]
Dorofeeva O.V., 1986
Dorofeeva O.V.,
On calculation of thermodynamic properties of polycyclic aromatic hydrocarbons,
Thermochim. Acta, 1986, 102, 59-66. [all data]
Frenkel M., 1994
Frenkel M.,
Thermodynamics of Organic Compounds in the Gas State, Vol. I, II, Thermodynamics Research Center, College Station, Texas, 1994, 1994. [all data]