N-ethyl-1-methylpropylamine
- Formula: C6H15N
- Molecular weight: 101.1900
- IUPAC Standard InChIKey: KFYKZKISJBGVMR-UHFFFAOYSA-N
- CAS Registry Number: 21035-44-9
- Chemical structure:
View 3d structure (requires JavaScript / HTML 5) - Species with the same structure:
- Other names: (dl) sec-butyl ethyl amine

Phase change data

Data compiled by: William E. Acree, Jr., James S. Chickos
Quantity | Value | Units | Method | Reference | Comment |
---|---|---|---|---|---|
ΔvapH° | 37.9 | kJ/mol | N/A | Stephenson and Malanowski, 1987 | Based on data from 283. to 372. K. See also Dykyj, 1972. |

References

Stephenson and Malanowski, 1987
Stephenson, Richard M.; Malanowski, Stanislaw,
Handbook of the Thermodynamics of Organic Compounds, 1987, https://doi.org/10.1007/978-94-009-3173-2
. [all data]
Dykyj, 1972
Dykyj, J.,
Petrochemia, 1972, 12, 1, 13. [all data]