Methanimidamide, N'-(4-chlorophenyl)-N,N-dimethyl-
- Formula: C9H11ClN2
- Molecular weight: 182.650
- IUPAC Standard InChIKey: ZPTXBCJETBDOAT-UHFFFAOYSA-N
- CAS Registry Number: 2103-46-0
- Chemical structure:
View 3d structure (requires JavaScript / HTML 5) - Other names: Formamidine, N'-(p-chlorophenyl)-N,N-dimethyl-; C 4789; N,N-Dimethyl-N'-(p-Chlorophenyl)formamidine; N,N-Dimethyl-N'-(4-chlorophenyl)formamidine; N'-(4-Chlorophenyl)-N,N-dimethylformamidine; Formamidine, 3,3-dimethyl-1-(4-chlorophenyl)

Gas phase ion energetics data

Data compiled by: Michael M. Meot-Ner (Mautner)
Proton affinity at 298K
Proton affinity (kJ/mol) | Reference |
---|---|
748. ± 2. | Traeger and McLoughlin, 1981 |

Kovats' RI, non-polar column, isothermal

Column type | Active phase | Temperature (C) | I | Reference | Comment |
---|---|---|---|---|---|
Packed | SE-30 | 240. | 1611. | Osek, Oszczapowicz, et al., 1986 | N2, Chromosorb W AW (60-80 mesh); Column length: 3. m |
Packed | SE-30 | 240. | 1611. | Oszczapowicz, Osek, et al., 1984 | N2, Chromosorb W AW; Column length: 3. m |

References

Traeger and McLoughlin, 1981
Traeger, J.C.; McLoughlin, R.G.,
Absolute heats of formation for gas phase cations,
J. Am. Chem. Soc., 1981, 103, 3647. [all data]
Osek, Oszczapowicz, et al., 1986
Osek, J.; Oszczapowicz, J.; Drzewinski, W.,
Prediction of Retention Indices of N1,N1-Dialkylformamidines on a Non-Polar Column,
J. Chromatogr., 1986, 351, 177-182, https://doi.org/10.1016/S0021-9673(01)83486-5
. [all data]
Oszczapowicz, Osek, et al., 1984
Oszczapowicz, J.; Osek, J.; Dolecka, E.,
Retention indices of dimethylformamidines, dimethylacetamidines and tetramethylguanidines on a non-polar column,
J. Chromatogr., 1984, 315, 95-100, https://doi.org/10.1016/S0021-9673(01)90727-7
. [all data]