Benzene, 1-azido-4-bromo-
- Formula: C6H4BrN3
- Molecular weight: 198.020
- IUPAC Standard InChIKey: WHSJSMSBFMDFHK-UHFFFAOYSA-N
- CAS Registry Number: 2101-88-4
- Chemical structure:
View 3d structure (requires JavaScript / HTML 5) - Other names: p-Bromophenyl azide; 1-Azido-4-bromobenzene; 4-Bromophenyl azide

Phase change data

Data compiled by: Robert L. Brown and Stephen E. Stein
Quantity | Value | Units | Method | Reference | Comment |
---|---|---|---|---|---|
Tfus | 293. | K | N/A | Buckingham and Donaghy, 1982 |
Reduced pressure boiling point
Tboil (K) | Pressure (bar) | Reference |
---|---|---|
378. | 0.013 | Buckingham and Donaghy, 1982 |

References

Buckingham and Donaghy, 1982
Buckingham, J.; Donaghy, S.M.,
Dictionary of Organic Compounds: Fifth Edition, Chapman and Hall, New York, 1982, 1. [all data]
Sheinker, 1951
Sheinker, Y.N.,
Doklady Akad. Nauk S.S.S.R. (in Rus.), 1951, 77, 1043. [all data]