1,2-cyclodecanediol

Phase change data

Data compiled by: Thermodynamics Research Center, NIST Boulder Laboratories, Chris Muzny director

Quantity Value Units Method Reference Comment
Tfus410.KN/ABlomquist, Burge, et al., 1952Uncertainty assigned by TRC = 6. K

In addition to the Thermodynamics Research Center (TRC) data available from this site, much more physical and chemical property data is available from the following TRC products:

References

Blomquist, Burge, et al., 1952
Blomquist, A.T.; Burge, R.E.; Sucsy, A.C., Many-Membered Carbon Rings V. Cyclodecyne, cis- and trans-Cyclodecene, and Related Compounds, J. Am. Chem. Soc., 1952, 74, 3636. [all data]