Benzene, 2-chloro-1,4-dimethoxy-
- Formula: C8H9ClO2
- Molecular weight: 172.609
- IUPAC Standard InChIKey: QMXZSRVFIWACJH-UHFFFAOYSA-N
- CAS Registry Number: 2100-42-7
- Chemical structure:
View 3d structure (requires JavaScript / HTML 5) - Other names: Chlorohydroquinone dimethyl ether; 1-Chloro-2,5-dimethoxybenzene; 2-Chloro-1,4-dimethoxybenzene; 2,5-Dimethoxychlorobenzene; 6-Chloro-1,4-dimethoxy benzene; Chloro-1,4-dimethoxybenzene; 2-Chloro-4-methoxyphenol, methyl ether

Van Den Dool and Kratz RI, non-polar column, temperature ramp

Column type | Active phase | I | Reference | Comment |
---|---|---|---|---|
Capillary | VF-5MS | 1365. | Todua, 2011 | 30. m/0.25 mm/0.25 μm, He; Tstart: 60. C; Tend: 270. C |
Capillary | OV-1 | 1312.9 | Gautzsch and Zinn, 1996 | 8. K/min; Tstart: 35. C; Tend: 300. C |

Van Den Dool and Kratz RI, non-polar column, custom temperature program

Column type | Active phase | I | Reference | Comment |
---|---|---|---|---|
Capillary | VF-5MS | 1356.2 | Tret'yakov, 2008 | 30. m/0.25 mm/0.25 μm, He; Program: Multi-step temperature program; T(initial)=60C; T(final)=270C |

References

Todua, 2011
Todua, N.G.,
Retention Data. NIST Mass Spectrometry Data Center., NIST Mass Spectrometry Data Center, 2011. [all data]
Gautzsch and Zinn, 1996
Gautzsch, R.; Zinn, P.,
Use of incremental models to estimate the retention indexes of aromatic compounds,
Chromatographia, 1996, 43, 3/4, 163-176, https://doi.org/10.1007/BF02292946
. [all data]
Tret'yakov, 2008
Tret'yakov, K.V.,
Retention Data. NIST Mass Spectrometry Data Center., NIST Mass Spectrometry Data Center, 2008. [all data]