Heptane, 1,1-dicyclohexyl-
- Formula: C19H36
- Molecular weight: 264.4891
- IUPAC Standard InChIKey: HPTHOHVOEWQDAX-UHFFFAOYSA-N
- CAS Registry Number: 2090-15-5
- Chemical structure:
View 3d structure (requires JavaScript / HTML 5) - Other names: 1,1-Dicyclohexylheptane; Cyclohexane, 1,1'-heptylidenebis-

Condensed phase thermochemistry data

Data compiled as indicated in comments:
ALS - Hussein Y. Afeefy, Joel F. Liebman, and Stephen E. Stein
DH - Eugene S. Domalski and Elizabeth D. Hearing
Quantity | Value | Units | Method | Reference | Comment |
---|---|---|---|---|---|
ΔcH°liquid | -12030.5 | kJ/mol | Ccb | Gollis, Belenyessy, et al., 1962 | Corresponding ΔfHºliquid = -591.1 kJ/mol (simple calculation by NIST; no Washburn corrections); ALS |
Constant pressure heat capacity of liquid
Cp,liquid (J/mol*K) | Temperature (K) | Reference | Comment |
---|---|---|---|
534.7 | 313. | Gudinowicz, Campbell, et al., 1963 | T = 313 to 583 K.; DH |
531.4 | 311. | Gollis, Belenyessy, et al., 1962, 2 | Temperatures 100, 200, 300°F.; DH |

Phase change data

Data compiled as indicated in comments:
TRC - Thermodynamics Research Center, NIST Boulder Laboratories, Chris Muzny director
AC - William E. Acree, Jr., James S. Chickos
Quantity | Value | Units | Method | Reference | Comment |
---|---|---|---|---|---|
Tfus | 241.48 | K | N/A | Anonymous, 1968 | Uncertainty assigned by TRC = 0.5 K; TRC |
Tfus | 230. | K | N/A | Gollis, Belenyessy, et al., 1962, 3 | Uncertainty assigned by TRC = 1.66 K; TRC |
Tfus | 238. | K | N/A | Chel'tsova and Petrov, 1957 | Uncertainty assigned by TRC = 5. K; TRC |
Enthalpy of vaporization
ΔvapH (kJ/mol) | Temperature (K) | Method | Reference | Comment |
---|---|---|---|---|
87.8 | 330. | A | Stephenson and Malanowski, 1987 | Based on data from 293. to 368. K. See also Dykyj, Svoboda, et al., 1999.; AC |
73.8 | 437. | A,MG | Stephenson and Malanowski, 1987 | Based on data from 422. to 458. K. See also Schiessler and Whitmore, 1955.; AC |

References

Gollis, Belenyessy, et al., 1962
Gollis, M.H.; Belenyessy, L.I.; Gudzinowicz, B.J.; Koch, S.D.; Smith, J.O.; Wineman, R.J.,
Evaluation of pure hydrocarbons as jet fuels,
J. Chem. Eng. Data, 1962, 7, 331-316. [all data]
Gudinowicz, Campbell, et al., 1963
Gudinowicz, B.J.; Campbell, R.H.; Adams, J.S.,
Specific heat measurements of complex saturated hydrocarbons,
J. Chem. Eng. Data, 1963, 8, 201-214. [all data]
Gollis, Belenyessy, et al., 1962, 2
Gollis, M.H.; Belenyessy, L.I.; Gudzinowicz, B.J.; Koch, S.D.; Smith, J.O.; Wineman, R.J.,
Evaluations of pure hydrocarbons as Jet Fuels,
J. Chem. Eng. Data, 1962, 7, 311-316. [all data]
Anonymous, 1968
Anonymous, R.,
Properties of hydrocarbon of high molecular weight, Am. Pet. Inst. Res. Proj. 42, Penn. State Univ., 1968. [all data]
Gollis, Belenyessy, et al., 1962, 3
Gollis, M.H.; Belenyessy, L.I.; Gudzinowicz, B.J.; Koch, S.D.; Smith, J.O.; Wineman, R.J.,
Evaluation of pure hydrocarbons as jet fuels.,
J. Chem. Eng. Data, 1962, 7, 311-6. [all data]
Chel'tsova and Petrov, 1957
Chel'tsova, M.A.; Petrov, A.D.,
Organomagnesium Synthesis and Hydrogenation of Triphenylalkylmethanes,
Zhur. Obshchei Khim., 1957, 27, 600-3. [all data]
Stephenson and Malanowski, 1987
Stephenson, Richard M.; Malanowski, Stanislaw,
Handbook of the Thermodynamics of Organic Compounds, 1987, https://doi.org/10.1007/978-94-009-3173-2
. [all data]
Dykyj, Svoboda, et al., 1999
Dykyj, J.; Svoboda, J.; Wilhoit, R.C.; Frenkel, M.L.; Hall, K.R.,
Vapor Pressure of Chemicals: Part A. Vapor Pressure and Antoine Constants for Hydrocarbons and Sulfur, Selenium, Tellurium and Hydrogen Containing Organic Compounds, Springer, Berlin, 1999, 373. [all data]
Schiessler and Whitmore, 1955
Schiessler, R.W.; Whitmore, F.C.,
Properties of High Molecular Weight Hydrocarbons,
Ind. Eng. Chem., 1955, 47, 8, 1660-1665, https://doi.org/10.1021/ie50548a054
. [all data]