Chrysene, octadecahydro-
- Formula: C18H30
- Molecular weight: 246.4308
- IUPAC Standard InChIKey: ZEMKTMFBYLHVNN-UHFFFAOYSA-N
- CAS Registry Number: 2090-14-4
- Chemical structure:
View 3d structure (requires JavaScript / HTML 5) - Other names: D-Homo-18-norestrane; Octadecahydrochrysene; Perhydrochrysene; Chrysitane; Perhydrochrysene, # 6; Perhydrochrysene, # 7; Perhydrochrysene, # 4; Perhydrochrysene, # 5; Perhydrochrysene, # 2; Perhydrochrysene, # 3; Perhydrochrysene, # 1

Kovats' RI, non-polar column, isothermal

Column type | Active phase | Temperature (C) | I | Reference | Comment |
---|---|---|---|---|---|
Capillary | SE-30 | 175. | 1963. | Bredael, 1982 | Column length: 100. m; Column diameter: 0.5 mm |
Capillary | SE-30 | 175. | 1972. | Bredael, 1982 | Column length: 100. m; Column diameter: 0.5 mm |
Capillary | SE-30 | 175. | 1985. | Bredael, 1982 | Column length: 100. m; Column diameter: 0.5 mm |
Capillary | SE-30 | 175. | 1991. | Bredael, 1982 | Column length: 100. m; Column diameter: 0.5 mm |

Phase change data

Data compiled as indicated in comments:
AC - William E. Acree, Jr., James S. Chickos

Enthalpy of vaporization

ΔvapH (kcal/mol) Temperature (K) Reference Comment
19.7288.Morecroft, 1964Based on data from 273. - 353. K.; AC

Antoine Equation Parameters

log10(P) = A − (B / (T + C))
    P = vapor pressure (atm)
    T = temperature (K)

View plot Requires a JavaScript / HTML 5 canvas capable browser.

Temperature (K) A B C Reference Comment
273. - 353.7.754324305.9790.053Morecroft, 1964Coefficents calculated by NIST from author's data.

References

Bredael, 1982
Bredael, P.,
Retention indices of hydrocarbons on SE-30,
J. Hi. Res. Chromatogr. Chromatogr. Comm., 1982, 5, 6, 325-328, https://doi.org/10.1002/jhrc.1240050610
. [all data]