Cyclopropane, 1,1-dichloro-
- Formula: C3H4Cl2
- Molecular weight: 110.970
- IUPAC Standard InChIKey: MZJYQXPULRLGCA-UHFFFAOYSA-N
- CAS Registry Number: 2088-35-9
- Chemical structure:
View 3d structure (requires JavaScript / HTML 5) - Other names: 1,1-dichlorocyclopropane

Gas phase thermochemistry data

Data compiled by: Hussein Y. Afeefy, Joel F. Liebman, and Stephen E. Stein
Quantity | Value | Units | Method | Reference | Comment |
---|---|---|---|---|---|
ΔfH°gas | Cm | Andreevskii and Antonova, 1982 | uncertain value: 6.7 kJ/mol |

Condensed phase thermochemistry data

Data compiled by: Hussein Y. Afeefy, Joel F. Liebman, and Stephen E. Stein
Quantity | Value | Units | Method | Reference | Comment |
---|---|---|---|---|---|
ΔfH°liquid | Cm | Andreevskii and Antonova, 1982 | uncertain value: -27. kJ/mol | ||
ΔfH°liquid | -27. ± 1.2 | kJ/mol | Ccr | Kolesov, Tomareva, et al., 1970 | |
Quantity | Value | Units | Method | Reference | Comment |
ΔcH°liquid | -1772.2 ± 1.2 | kJ/mol | Ccr | Kolesov, Tomareva, et al., 1970 |

References

Andreevskii and Antonova, 1982
Andreevskii, D.N.; Antonova, Z.A.,
Development of an increment scheme for calculating the thermodynamic properties of organic polyfluoro compounds,
J. Appl. Chem. USSR, 1982, 55, 582-587. [all data]
Kolesov, Tomareva, et al., 1970
Kolesov, V.P.; Tomareva, E.M.; Shostakovskii, V.M.; Nefedov, O.M.; Skuratov, S.M.,
Standard enthalpy of formation of 1,1-dichlorocyclopropane,
J. Phys. Chem., 1970, 44, 865-867. [all data]