Benzobicyclo[2.2.0]hexa-2,5-diene
- Formula: C10H8
- Molecular weight: 128.1705
- IUPAC Standard InChIKey: JYKMWOMRHHJZMI-UHFFFAOYSA-N
- CAS Registry Number: 20847-82-9
- Chemical structure:
View 3d structure (requires JavaScript / HTML 5) - Permanent link for this species. Use this link for bookmarking this species for future reference.

Gas phase thermochemistry data

Data compiled by: Hussein Y. Afeefy, Joel F. Liebman, and Stephen E. Stein
Quantity | Value | Units | Method | Reference | Comment |
---|---|---|---|---|---|
ΔfH°gas | 399. ± 7.9 | kJ/mol | Ciso | Grimme and Heinze, 1978 |

Reaction thermochemistry data

Data compiled by: Hussein Y. Afeefy, Joel F. Liebman, and Stephen E. Stein
Individual Reactions
By formula: C10H8 = C10H8
Quantity | Value | Units | Method | Reference | Comment |
---|---|---|---|---|---|
ΔrH° | -248.5 ± 8.0 | kJ/mol | Eqk | Dreeskamp, Kapahnke, et al., 1988 | liquid phase; solvent: Heptane; Isomerization |
ΔrH° | -249.2 ± 8.0 | kJ/mol | Ciso | Grimme and Heinze, 1978 | liquid phase; solvent: Heptane |

References

Grimme and Heinze, 1978
Grimme, W.; Heinze, U.,
Kinetics and enthalpy of isomerization of benzobicyclo[2.2.0]hexa-2,5-diene,
Chem. Ber., 1978, 111, 2563-2570. [all data]
Dreeskamp, Kapahnke, et al., 1988
Dreeskamp, H.; Kapahnke, P.; Tochtermann, W.,
Photo valence isomerization of sterically strained aromatic hydrocarbons: 8,9-dicarbethoxy[6]paracyclophane,
Radiat. Phys. Chem., 1988, 32, 537-539. [all data]