2-Pentanethiol
- Formula: C5H12S
- Molecular weight: 104.214
- IUPAC Standard InChIKey: QUSTYFNPKBDELJ-UHFFFAOYSA-N
- CAS Registry Number: 2084-19-7
- Chemical structure:
View 3d structure (requires JavaScript / HTML 5) - Other names: 1-Methylbutanethiol; sec-Amyl mercaptan; 2-Pentylthiol; 2-Mercaptopentane; Pentane-2-thiol

Phase change data

Data compiled as indicated in comments:
TRC - Thermodynamics Research Center, NIST Boulder Laboratories, Chris Muzny director
AC - William E. Acree, Jr., James S. Chickos
Quantity | Value | Units | Method | Reference | Comment |
---|---|---|---|---|---|
Tfus | 104.2 | K | N/A | Ellis and Reid, 1932 | Uncertainty assigned by TRC = 0.3 K; TRC |
Enthalpy of vaporization
ΔvapH (kJ/mol) | Temperature (K) | Method | Reference | Comment |
---|---|---|---|---|
38.4 | 302. | N/A | Dykyj, Svoboda, et al., 1999 | Based on data from 287. to 412. K.; AC |
37.8 | 361. | A | Stephenson and Malanowski, 1987 | Based on data from 347. to 435. K.; AC |

Kovats' RI, non-polar column, custom temperature program

View large format table.

Column type Active phase I Reference Comment
CapillaryApiezon M782.Zhu, Wang, et al., 2007Program: not specified

Kovats' RI, polar column, isothermal

View large format table.

Column type Active phase Temperature (C) I Reference Comment
CapillaryPEG-20M93.967.9Morishita, Murakita, et al., 1985Column length: 50. m; Column diameter: 0.25 mm
CapillaryPEG-20M80.964.9Morishita, Murakita, et al., 1982N2; Column length: 50. m; Column diameter: 0.25 mm

Kovats' RI, polar column, custom temperature program

View large format table.

Column type Active phase I Reference Comment
CapillaryPEG-20M992.Zhu, Wang, et al., 2007Program: not specified

Normal alkane RI, non-polar column, isothermal

View large format table.

Column type Active phase Temperature (C) I Reference Comment
CapillaryDC-20050.751.Leppin, Gollnick, et al., 1969Argon; Column length: 100. m

References

Ellis and Reid, 1932
Ellis, L.M.; Reid, E.E.,
The Preparation and Properties of A Double Series of Aliphatic Mercaptans,
J. Am. Chem. Soc., 1932, 54, 1674. [all data]
Dykyj, Svoboda, et al., 1999
Dykyj, J.; Svoboda, J.; Wilhoit, R.C.; Frenkel, M.L.; Hall, K.R.,
Vapor Pressure of Chemicals: Part A. Vapor Pressure and Antoine Constants for Hydrocarbons and Sulfur, Selenium, Tellurium and Hydrogen Containing Organic Compounds, Springer, Berlin, 1999, 373. [all data]
Stephenson and Malanowski, 1987
Stephenson, Richard M.; Malanowski, Stanislaw,
Handbook of the Thermodynamics of Organic Compounds, 1987, https://doi.org/10.1007/978-94-009-3173-2
. [all data]