2,5-Bis(4-biphenylyl)oxazole
- Formula: C27H19NO
- Molecular weight: 373.4459
- IUPAC Standard InChIKey: DDZJGFHXUOWOSL-UHFFFAOYSA-N
- CAS Registry Number: 2083-09-2
- Chemical structure:
- Other names: Oxazole, 2,5-bis([1,1'-biphenyl]-4-yl)-; 2,5-di(biphenyl-4-yl)oxazole; 2,5-bis(1,1'-biphenylyl)oxazole

Phase change data

Data compiled by: William E. Acree, Jr., James S. Chickos
Enthalpy of vaporization
ΔvapH (kcal/mol) | Temperature (K) | Method | Reference | Comment |
---|---|---|---|---|
26.22 | 610. | A,I | Stephenson and Malanowski, 1987 | Based on data from 595. to 685. K. See also Steyer and Schäfer, 1975. |

References

Stephenson and Malanowski, 1987
Stephenson, Richard M.; Malanowski, Stanislaw,
Handbook of the Thermodynamics of Organic Compounds, 1987, https://doi.org/10.1007/978-94-009-3173-2
. [all data]
Steyer and Schäfer, 1975
Steyer, Bernd; Schäfer, Fritz P.,
Stimulated and spontaneous emission from laser dyes in the vapor phase,
Appl. Phys., 1975, 7, 2, 113-122, https://doi.org/10.1007/BF00884220
. [all data]