2-methyl-3-octene
- Formula: C9H18
- Molecular weight: 126.2392
- IUPAC Standard InChIKey: RXYSIDRRVRTDIF-BQYQJAHWSA-N
- CAS Registry Number: 20826-35-1
- Chemical structure:
View 3d structure (requires JavaScript / HTML 5) - Species with the same structure:
- Stereoisomers:

Phase change data

Data compiled by: Thermodynamics Research Center, NIST Boulder Laboratories, Chris Muzny director
Quantity | Value | Units | Method | Reference | Comment |
---|---|---|---|---|---|
Tboil | 410.51 | K | N/A | Spengler, 1948 | Uncertainty assigned by TRC = 0.5 K |

References

Spengler, 1948
Spengler, G.,
Unpublished, Inst. Kohleforschung, Prague, Czechosl- ovakia (transmitted by L. L. Newman, U. S, 1948. [all data]