Valeric anhydride
- Formula: C10H18O3
- Molecular weight: 186.2481
- IUPAC Standard InChIKey: DUCKXCGALKOSJF-UHFFFAOYSA-N
- CAS Registry Number: 2082-59-9
- Chemical structure:
View 3d structure (requires JavaScript / HTML 5) - Other names: n-Valeric anhydride; Pentanoic anhydride; Pentanoic acid, anhydride

Phase change data

Data compiled as indicated in comments:
TRC - Thermodynamics Research Center, NIST Boulder Laboratories, Chris Muzny director
BS - Robert L. Brown and Stephen E. Stein
Quantity | Value | Units | Method | Reference | Comment |
---|---|---|---|---|---|
Tboil | 459.5 | K | N/A | Timmermans, 1927 | Uncertainty assigned by TRC = 0.3 K; source of data not clear; TRC |
Quantity | Value | Units | Method | Reference | Comment |
Tfus | 217.05 | K | N/A | Timmermans, 1927 | Uncertainty assigned by TRC = 0.7 K; TRC |
Reduced pressure boiling point
Tboil (K) | Pressure (bar) | Reference | Comment |
---|---|---|---|
384.7 | 0.021 | Aldrich Chemical Company Inc., 1990 | BS |
384.2 | 0.020 | Weast and Grasselli, 1989 | BS |

References

Timmermans, 1927
Timmermans, J.,
The Melting Point of Organic Substances,
Bull. Soc. Chim. Belg., 1927, 36, 502. [all data]
Aldrich Chemical Company Inc., 1990
Aldrich Chemical Company Inc.,
Catalog Handbook of Fine Chemicals, Aldrich Chemical Company, Inc., Milwaukee WI, 1990, 1. [all data]
Weast and Grasselli, 1989
CRC Handbook of Data on Organic Compounds, 2nd Editon, Weast,R.C and Grasselli, J.G., ed(s)., CRC Press, Inc., Boca Raton, FL, 1989, 1. [all data]