1-Propene-1,2,3-tricarboxylic acid, trimethyl ester
- Formula: C9H12O6
- Molecular weight: 216.1880
- IUPAC Standard InChIKey: DZAIBGWGBBQGPZ-UHFFFAOYSA-N
- CAS Registry Number: 20820-77-3
- Chemical structure:
View 3d structure (requires JavaScript / HTML 5) - Stereoisomers:
- Other names: Trimethyl aconitate; 1,2,3-Propenetricarboxylic acid, trimethyl ester; 3-Methoxycarbonyl-pent-2-enedioic acid dimethyl ester; Trimethyl 1-propene-1,2,3-tricarboxylate; Aconitic acid, trimethyl ester

Normal alkane RI, non-polar column, temperature ramp

Column type | Active phase | I | Reference | Comment |
---|---|---|---|---|
Capillary | OV-101 | 1428. | Pinkston, Spiteller, et al., 1981 | H2, 80. C @ 7. min, 2. K/min; Column length: 30. m; Column diameter: 0.3 mm; Tend: 275. C |

References

Pinkston, Spiteller, et al., 1981
Pinkston, D.; Spiteller, G.; von Henning, H.; Matthaei, D.,
High-resolution gas chromatography-mass spectrometry of the methyl esters of organic acids from uremic hemofiltrates,
J. Chromatogr., 1981, 223, 1, 1-19, https://doi.org/10.1016/S0378-4347(00)80063-8
. [all data]