((CH3)2N)2C=N-(4-CH3-C6H4)

Gas phase ion energetics data

Data evaluated by: Edward P. Hunter and Sharon G. Lias

Quantity Value Units Method Reference Comment
Proton affinity (review)1044.3kJ/molN/AHunter and Lias, 1998
Quantity Value Units Method Reference Comment
Gas basicity1011.9kJ/molN/AHunter and Lias, 1998

References

Hunter and Lias, 1998
Hunter, E.P.; Lias, S.G., Evaluated Gas Phase Basicities and Proton Affinities of Molecules: An Update, J. Phys. Chem. Ref. Data, 1998, 27, 3, 413-656, https://doi.org/10.1063/1.556018 . [all data]