4-Octanone, 7-methyl-
- Formula: C9H18O
- Molecular weight: 142.2386
- IUPAC Standard InChIKey: JUTSLBALKVVBQM-UHFFFAOYSA-N
- CAS Registry Number: 20809-46-5
- Chemical structure:
View 3d structure (requires JavaScript / HTML 5) - Other names: 7-Methyl-4-octanone

Phase change data

Data compiled by: Thermodynamics Research Center, NIST Boulder Laboratories, Chris Muzny director
Quantity | Value | Units | Method | Reference | Comment |
---|---|---|---|---|---|
Tboil | 451. | K | N/A | Powell and Hagemann, 1944 | Uncertainty assigned by TRC = 4. K |

References

Powell and Hagemann, 1944
Powell, S.G.; Hagemann, F.,
The Condensation of Isobutyraldehyde with Aliphatic Ketones,
J. Am. Chem. Soc., 1944, 66, 372. [all data]