Dinaphtho[1,2-b:1',2'-d]thiophene
- Formula: C20H12S
- Molecular weight: 284.374
- IUPAC Standard InChIKey: SYXXZXWLYNODHL-UHFFFAOYSA-N
- CAS Registry Number: 207-94-3
- Chemical structure:
View 3d structure (requires JavaScript / HTML 5) - Other names: dinaphtho[1,1-b:1',2'-d]thiophene; dinaphto[1,2-b:1',2'-d]thiophene; Dinaphtho[1,2-b;1',2'-d]thiophene

Lee's RI, non-polar column, temperature ramp

Column type | Active phase | I | Reference | Comment |
---|---|---|---|---|
Capillary | DB-5 | 484.6 | Becker and Colmsjö, 1998 | 30. m/0.25 mm/0.25 μm, He, 110. C @ 1. min, 10. K/min, 325. C @ 5. min |
Capillary | SE-52 | 486.58 | Vassilaros, Kong, et al., 1982 | 20. m/0.30 mm/0.25 μm, H2, 40. C @ 2. min, 4. K/min; Tend: 265. C |

Lee's RI, non-polar column, custom temperature program

Column type | Active phase | I | Reference | Comment |
---|---|---|---|---|
Capillary | SPB-5 | 472.89 | Thuss, Popp, et al., 2000 | 60. m/0.32 mm/0.10 μm, He; Program: A: 105 0C (2 min) 2.5 0C -> 230 0C 50 0C/min -> 305 0C (15 min) B: 95 0C (2 min) 3.8 0C/min -> 310 0C (5 min) |
Capillary | DB-5 | 479.7 | Becker and Colmsjö, 1998 | 30. m/0.25 mm/0.25 μm, He; Program: 110C(1min) => 40C/min => 160C => 10C/min => 300C925min) |
Capillary | DB-5 | 479.1 | Becker and Colmsjö, 1998 | 30. m/0.25 mm/0.25 μm, He; Program: 35C(2min) => 25C/min => 160C => 3C/min => 300C(25min) |

References

Becker and Colmsjö, 1998
Becker, G.; Colmsjö, A.,
Gas chromatography-atomic emission detection for quantification of polycyclic aromatic sulfur heterocycles,
Anal. Chim. Acta., 1998, 376, 3, 265-272, https://doi.org/10.1016/S0003-2670(98)00546-7
. [all data]
Vassilaros, Kong, et al., 1982
Vassilaros, D.L.; Kong, R.C.; Later, D.W.; Lee, M.L.,
Linear retention index system for polycyclic aromatic compounds. Critical evaluation and additional indices,
J. Chromatogr., 1982, 252, 1-20, https://doi.org/10.1016/S0021-9673(01)88394-1
. [all data]
Thuss, Popp, et al., 2000
Thuss, U.; Popp, P.; Ehrlich, C.; Kalkoff, W.-D.,
Identification and quantification of thaarenes in the flue gas of lignite-fired domestic heating,
J. Hi. Res. Chromatogr., 2000, 23, 7/8, 457-473, https://doi.org/10.1002/1521-4168(20000801)23:7/8<457::AID-JHRC457>3.0.CO;2-7
. [all data]