Gallic acid, 4TMS derivative
- Formula: C19H38O5Si4
- Molecular weight: 458.8440
- IUPAC Standard InChIKey: KCIFUQKNKZTHGI-UHFFFAOYSA-N
- CAS Registry Number: 2078-17-3
- Chemical structure:
View 3d structure (requires JavaScript / HTML 5) - Other names: Benzoic acid, 3,4,5-tris(trimethylsiloxy)-, trimethylsilyl ester; Gallic acid, tetraTMS; Trimethylsilyl 3,4,5-tris((trimethylsilyl)oxy)benzoate; Gallic acid, TMS; Benzoic acid, 3,4,5-tris-trimethylsilyloxy, trimethylsilyl ester

Van Den Dool and Kratz RI, non-polar column, temperature ramp

Column type | Active phase | I | Reference | Comment |
---|---|---|---|---|
Capillary | DB-5 | 1987. | Jaroszynska and Ligor, 2005 | 30. m/0.25 mm/0.25 μm, He, 3. K/min; Tstart: 50. C; Tend: 320. C |
Capillary | DB-5 | 1990. | Jaroszynska and Ligor, 2005 | 30. m/0.25 mm/0.25 μm, He, 3. K/min; Tstart: 50. C; Tend: 320. C |
Capillary | DB-5 | 1991. | Jaroszynska and Ligor, 2005 | 30. m/0.25 mm/0.25 μm, He, 3. K/min; Tstart: 50. C; Tend: 320. C |
Capillary | DB-5 | 1991. | Jaroszynska and Ligor, 2005 | 30. m/0.25 mm/0.25 μm, He, 3. K/min; Tstart: 50. C; Tend: 320. C |
Capillary | PE-5ht | 1991. | Jaroszynska and Ligor, 2005 | 30. m/0.25 mm/0.1 μm, He, 3. K/min; Tstart: 50. C; Tend: 320. C |
Capillary | PE-5ht | 1994. | Jaroszynska and Ligor, 2005 | 30. m/0.25 mm/0.1 μm, He, 3. K/min; Tstart: 50. C; Tend: 320. C |
Capillary | PE-5ht | 1994. | Jaroszynska and Ligor, 2005 | 30. m/0.25 mm/0.1 μm, He, 3. K/min; Tstart: 50. C; Tend: 320. C |
Capillary | PE-5ht | 1995. | Jaroszynska and Ligor, 2005 | 30. m/0.25 mm/0.1 μm, He, 3. K/min; Tstart: 50. C; Tend: 320. C |
Capillary | PE-5ms | 1962. | Jaroszynska and Ligor, 2005 | 30. m/0.25 mm/0.25 μm, He, 3. K/min; Tstart: 50. C; Tend: 320. C |
Capillary | PE-5ms | 1962. | Jaroszynska and Ligor, 2005 | 30. m/0.25 mm/0.25 μm, He, 3. K/min; Tstart: 50. C; Tend: 320. C |
Capillary | DB-5 | 1984. | Jaroszynska, 2003 | 30. m/0.25 mm/0.25 μm, He, 3. K/min; Tstart: 50. C; Tend: 240. C |
Capillary | DB-5 | 1991. | Jaroszynska, 2003 | 30. m/0.25 mm/0.25 μm, He, 3. K/min; Tstart: 50. C; Tend: 240. C |
Capillary | DB-5 | 1978. | Jaroszynska, 2003 | 30. m/0.25 mm/0.25 μm, He, 7. K/min; Tstart: 50. C; Tend: 240. C |
Capillary | DB-5 | 1986. | Jaroszynska, 2003 | 30. m/0.25 mm/0.25 μm, He, 7. K/min; Tstart: 50. C; Tend: 240. C |
Capillary | SE-52 | 1983. | Lefevere, Verhaeghe, et al., 1989 | 25. m/0.32 mm/0.52 μm, He, 5. K/min; Tstart: 70. C; Tend: 270. C |
Packed | OV-1 | 1976. | Mattsson and Petersson, 1977 | N2, Supelcoport, 4. K/min; Column length: 2. m; Tstart: 80. C; Tend: 240. C |

Van Den Dool and Kratz RI, non-polar column, custom temperature program

Column type | Active phase | I | Reference | Comment |
---|---|---|---|---|
Capillary | HP-5MS | 1978.6 | Andriamaharavo, 2014 | 30. m/0.25 mm/0.25 μm, He; Program: 60C (1 min) => 5 C/min => 210C => 10 C/min => 280C (15 min) |

Normal alkane RI, non-polar column, temperature ramp

Column type | Active phase | I | Reference | Comment |
---|---|---|---|---|
Capillary | HP-5 | 1983. | Isidorov, Kotowska, et al., 2005 | 30. m/0.25 mm/0.25 μm, He; Tstart: 50. C; Tend: 300. C |
Capillary | HP-5 | 1981. | Isidorov, Kotowska, et al., 2005 | 30. m/0.25 mm/0.25 μm, He, 5. K/min; Tstart: 50. C; Tend: 300. C |

References

Jaroszynska and Ligor, 2005
Jaroszynska, J.; Ligor, T.,
The identification of phenolic compounds by a gas chromatographic method on three capillary columns with the same non-polar stationary phase,
Anal. Chim. Acta., 2005, 539, 1-2, 11-15, https://doi.org/10.1016/j.aca.2005.03.024
. [all data]
Jaroszynska, 2003
Jaroszynska, J.,
Isolation of free phenolic compounds from arboreal leaves by use of the Florisil/C18 system,
Anal. Bioanal. Chem., 2003, 377, 4, 702-708, https://doi.org/10.1007/s00216-003-2155-z
. [all data]
Lefevere, Verhaeghe, et al., 1989
Lefevere, M.F.; Verhaeghe, B.J.; Declerck, D.H.; Van Bocxlaer, J.F.; De Leenheer, A.P.; De Sagher, R.M.,
Metabolic Profiling of Urinary Organic Acids by Single and Multicolumn Capillary Gas Chromatography,
J. Chromatogr. Sci., 1989, 27, 1, 23-29, https://doi.org/10.1093/chromsci/27.1.23
. [all data]
Mattsson and Petersson, 1977
Mattsson, M.; Petersson, G.,
Reference GLC Data for the Analysis of Phenolic Compounds as Trimethylsilyl Derivatives,
J. Chromatogr. Sci., 1977, 15, 12, 546-554, https://doi.org/10.1093/chromsci/15.12.546
. [all data]
Andriamaharavo, 2014
Andriamaharavo, N.R.,
Retention Data. NIST Mass Spectrometry Data Center., NIST Mass Spectrometry Data Center, 2014. [all data]
Isidorov, Kotowska, et al., 2005
Isidorov, V.A.; Kotowska, U.; Vinogorova, V.T.,
GC Identification of organic compounds based on partition coefficients of their TMS derivatives in a hexane-acetonitrile system and retention indices,
Anal. Sci., 2005, 21, 12, 1483-1489, https://doi.org/10.2116/analsci.21.1483
. [all data]