Benzene, (epoxyethyl)-, (R)-
- Formula: C8H8O
- Molecular weight: 120.1485
- IUPAC Standard InChIKey: AWMVMTVKBNGEAK-MRVPVSSYSA-N
- CAS Registry Number: 20780-53-4
- Chemical structure:
View 3d structure (requires JavaScript / HTML 5) - Stereoisomers:
- Other names: (R)-(Epoxyethyl)benzene; R-Phenyloxirane; (R)-Styrene oxide; Oxirane, 2-phenyl-, (2R)-

Phase change data

Data compiled by: Robert L. Brown and Stephen E. Stein
Reduced pressure boiling point
Tboil (K) | Pressure (bar) | Reference |
---|---|---|
362.7 | 0.031 | Aldrich Chemical Company Inc., 1990 |

References

Aldrich Chemical Company Inc., 1990
Aldrich Chemical Company Inc.,
Catalog Handbook of Fine Chemicals, Aldrich Chemical Company, Inc., Milwaukee WI, 1990, 1. [all data]