Cholest-14-en-3-ol, (3β,5α)-
- Formula: C27H46O
- Molecular weight: 386.6535
- IUPAC Standard InChIKey: DYNILEUACBZVPX-IMUJTPCMSA-N
- CAS Registry Number: 20780-35-2
- Chemical structure:
View 3d structure (requires JavaScript / HTML 5) - Other names: 3β,5α-Cholest-14-en-3-ol; 5α-Cholest-14-en-3β-ol

Kovats' RI, non-polar column, isothermal

Column type | Active phase | Temperature (C) | I | Reference | Comment |
---|---|---|---|---|---|
Capillary | Methyl Silicone | 250. | 3120. | Shlyakhov, 1984 |

References

Shlyakhov, 1984
Shlyakhov, A.F.,
Gas chromatography in organic geochemistry, Nedra, Moscow, 1984, 221. [all data]