Lavandulyl acetate
- Formula: C12H20O2
- Molecular weight: 196.2860
- IUPAC Standard InChIKey: HYNGAVZPWWXQIU-UHFFFAOYSA-N
- CAS Registry Number: 20777-39-3
- Chemical structure:
View 3d structure (requires JavaScript / HTML 5) - Other names: (-)-Lavandulyl acetate; 4-Hexen-1-ol, 5-methyl-2-(1-methylethenyl)-, acetate, (R)-; (.+/-.)-Lavandulol, acetate; 2-Isopropenyl-5-methyl-4-hexenyl acetate; (E)-Lavandulyl acetate; Lavendulyl acetate; (R)-2-isopropenyl-5-methylhex-4-enyl acetate

Kovats' RI, non-polar column, isothermal

Column type | Active phase | Temperature (C) | I | Reference | Comment |
---|---|---|---|---|---|
Packed | OV-101 | 140. | 1273. | Szabolcs, Benecke, et al., 1985 | Ar, W-AW-DMCS; Column length: 2. m |
Packed | OV-101 | 150. | 1274. | Szabolcs, Benecke, et al., 1985 | Ar, W-AW-DMCS; Column length: 2. m |
Packed | OV-101 | 160. | 1275. | Szabolcs, Benecke, et al., 1985 | Ar, W-AW-DMCS; Column length: 2. m |
Packed | OV-101 | 170. | 1276. | Szabolcs, Benecke, et al., 1985 | Ar, W-AW-DMCS; Column length: 2. m |
Capillary | OV-101 | 140. | 1273. | Benecke, Thieme, et al., 1982 | |
Capillary | OV-101 | 150. | 1274. | Benecke, Thieme, et al., 1982 | |
Capillary | OV-101 | 160. | 1275. | Benecke, Thieme, et al., 1982 | |
Capillary | OV-101 | 170. | 1276. | Benecke, Thieme, et al., 1982 |

Kovats' RI, non-polar column, temperature ramp

Column type | Active phase | I | Reference | Comment |
---|---|---|---|---|
Capillary | DB-5MS | 1283. | Angioni, Barra, et al., 2006 | 30. m/0.25 mm/0.25 μm, He, 3. K/min, 180. C @ 15. min; Tstart: 60. C |
Capillary | BP-1 | 1273. | Raina, Verma, et al., 2006 | 25. m/0.32 mm/0.25 μm, N2, 5. K/min, 220. C @ 13. min; Tstart: 60. C |
Capillary | HP-5MS | 1292. | Asuming, Beauchamp, et al., 2005 | 30. m/0.25 mm/0.25 μm, He, 50. C @ 10. min, 3. K/min, 250. C @ 5. min |
Capillary | DB-5 | 1304. | Avato, Raffo, et al., 2004 | 30. m/0.25 mm/0.25 μm, H2, 4. K/min, 280. C @ 30. min; Tstart: 40. C |
Capillary | BP-1 | 1278. | Raina, Lal, et al., 2002 | 60. m/0.32 mm/0.25 μm, N2, 5. K/min; Tstart: 60. C; Tend: 220. C |
Capillary | DB-1 | 1268. | Palá-Paúl, Velasco-Negueruela, et al., 2001 | 50. m/0.25 mm/0.25 μm, N2, 4. K/min; Tstart: 80. C; Tend: 225. C |
Capillary | DB-5 | 1301. | Loayza, Abujder, et al., 1995 | 40. C @ 2. min, 2. K/min, 210. C @ 120. min; Column length: 30. m |
Capillary | SPB-1 | 1276. | Wong and Tie, 1993 | He, 35. C @ 5. min, 3. K/min, 200. C @ 20. min; Column length: 50. m; Column diameter: 0.20 mm |

Kovats' RI, non-polar column, custom temperature program

Column type | Active phase | I | Reference | Comment |
---|---|---|---|---|
Capillary | DB-5MS | 1282. | Tuberoso, Kowalczyk, et al., 2005 | 30. m/0.25 mm/0.25 μm, He; Program: 60C(5min) => 2C/min => 140C= 5C/min => 250C(5min) |
Capillary | HP-5 | 1290. | Daferera, Ziogas, et al., 2003 | 30. m/0.25 mm/0.25 μm, He; Program: 40C (3min) => 3C/min => 180C => 30C/min => 270C (5min) |

Kovats' RI, polar column, isothermal

Column type | Active phase | Temperature (C) | I | Reference | Comment |
---|---|---|---|---|---|
Packed | Carbowax 20M | 150. | 1609. | ter Heide, 1968 | N2, Embacel; Column length: 2.5 m |

Kovats' RI, polar column, temperature ramp

Column type | Active phase | I | Reference | Comment |
---|---|---|---|---|
Capillary | DB-Wax | 1596. | Avato, Raffo, et al., 2004 | 30. m/0.25 mm/0.25 μm, H2, 40. C @ 2. min, 4. K/min, 260. C @ 15. min |
Capillary | Supelcowax-10 | 1609. | Loayza, Abujder, et al., 1995 | 40. C @ 2. min, 2. K/min, 210. C @ 120. min; Column length: 30. m |
Capillary | Supelcowax-10 | 1594. | Wong and Tie, 1993 | He, 35. C @ 5. min, 3. K/min, 200. C @ 20. min; Column length: 60. m; Column diameter: 0.25 mm |

Van Den Dool and Kratz RI, non-polar column, temperature ramp

Column type | Active phase | I | Reference | Comment |
---|---|---|---|---|
Capillary | RTX-1 | 1267. | Muselli, Rossi, et al., 2007 | 60. m/0.22 mm/0.25 μm, He, 2. K/min, 230. C @ 30. min; Tstart: 60. C |
Capillary | RTX-1 | 1272. | Cavalli, Tomi, et al., 2006 | 60. m/0.22 mm/0.25 μm, He, 2. K/min, 230. C @ 45. min; Tstart: 60. C |
Capillary | DB-5 | 1277. | Dob, Dahmane, et al., 2006 | 30. m/0.25 mm/0.25 μm, N2, 60. C @ 3. min, 3. K/min, 240. C @ 3. min |
Capillary | HP-5MS | 1293. | Saroglou, Dorizas, et al., 2006 | 30. m/0.25 mm/0.25 μm, He, 60. C @ 5. min, 4. K/min; Tend: 280. C |
Capillary | DB-1 | 1273. | Dob, Dahmane, et al., 2005 | 30. m/0.32 mm/0.25 μm, 50. C @ 8. min, 2. K/min; Tend: 250. C |
Capillary | HP-5 | 1290. | Javidnia, Miri, et al., 2005 | 30. m/0.25 mm/0.25 μm, He, 3. K/min; Tstart: 60. C; Tend: 260. C |
Capillary | RTX-1 | 1271. | Paolini, Costa, et al., 2005 | 60. m/0.22 mm/0.25 μm, He, 2. K/min, 230. C @ 35. min; Tstart: 60. C |
Capillary | BP-1 | 1273. | Vellutini, Baldovini, et al., 2005 | 50. m/0.22 mm/0.25 μm, He, 2. K/min, 230. C @ 35. min; Tstart: 60. C |
Capillary | HP-5MS | 1291. | Salido, Valenzuela, et al., 2004 | 30. m/0.25 mm/0.25 μm, He, 3. K/min; Tstart: 50. C; Tend: 250. C |
Capillary | DB-5 | 1289. | Bader, Flamini, et al., 2003 | 30. m/0.25 mm/0.25 μm, He, 3. K/min; Tstart: 60. C; Tend: 240. C |
Capillary | DB-5 | 1289. | Tampieri, Galuppi, et al., 2003 | 30. m/0.25 mm/0.25 μm, He, 3. K/min; Tstart: 60. C; Tend: 240. C |
Capillary | SPB-5 | 1289. | Pino, Marbot, et al., 2002 | 30. m/0.25 mm/0.25 μm, He, 60. C @ 2. min, 4. K/min, 250. C @ 20. min |
Capillary | RTX-5 | 1289. | Shellie, Mondello, et al., 2002 | 30. m/0.25 mm/0.25 μm, He, 45. C @ 6. min, 3. K/min; Tend: 250. C |
Capillary | RTX-5 | 1298. | Shellie, Mondello, et al., 2002 | 30. m/0.25 mm/0.25 μm, He, 45. C @ 6. min, 3. K/min; Tend: 250. C |
Capillary | HP-5 | 1288. | Couladis, Tsortanidou, et al., 2001 | 30. m/0.25 mm/0.25 μm, He, 3. K/min; Tstart: 60. C; Tend: 380. C |
Capillary | HP-5MS | 1291. | Salido, Altarejos, et al., 2001 | 30. m/0.25 mm/0.25 μm, He, 3. K/min; Tstart: 50. C; Tend: 250. C |
Packed | OV-101 | 1271. | Szabolcs, Benecke, et al., 1985 | Ar, W-AW-DMCS, 2. K/min; Column length: 2. m; Tstart: 100. C |
Capillary | OV-101 | 1271. | Benecke, Thieme, et al., 1982 | 2. K/min; Tstart: 100. C |

Van Den Dool and Kratz RI, non-polar column, custom temperature program

Column type | Active phase | I | Reference | Comment |
---|---|---|---|---|
Capillary | VF-5MS | 1284.1 | Tret'yakov, 2008 | 30. m/0.25 mm/0.25 μm, He; Program: Multi-step temperature program; T(initial)=60C; T(final)=270C |
Capillary | SPB-1 | 1275. | Sanz, Soria, et al., 2004 | 27. m/0.25 mm/0.25 μm, He; Program: 60C => 3C/min => 180C => 8C/min => 250C (5min) |
Capillary | SE-52 | 1289. | Mondello, Dugo, et al., 1995 | 60. m/0.32 mm/0.40 μm, He; Program: 45 C (6 min) 3 C/min -> 111 0C 2 C/min -> 160 C 3 C/min -> 300 C (15 min) |

Van Den Dool and Kratz RI, polar column, temperature ramp

Column type | Active phase | I | Reference | Comment |
---|---|---|---|---|
Capillary | RTX-Wax | 1584. | Muselli, Rossi, et al., 2007 | 60. m/0.22 mm/0.25 μm, He, 2. K/min, 230. C @ 30. min; Tstart: 60. C |
Capillary | RTX-Wax | 1602. | Cavalli, Tomi, et al., 2006 | 60. m/0.22 mm/0.25 μm, He, 2. K/min, 230. C @ 45. min; Tstart: 60. C |
Capillary | Polyethylene Glycol | 1605. | Dob, Dahmane, et al., 2006 | 30. m/0.32 mm/0.25 μm, N2, 50. C @ 10. min, 2. K/min, 230. C @ 15. min |
Capillary | RTX-Wax | 1606. | Paolini, Costa, et al., 2005 | 60. m/0.22 mm/0.25 μm, He, 2. K/min, 230. C @ 35. min; Tstart: 60. C |
Capillary | BP-20 | 1607. | Vellutini, Baldovini, et al., 2005 | 50. m/0.22 mm/0.25 μm, He, 2. K/min, 230. C @ 35. min; Tstart: 60. C |
Capillary | RTX-Wax | 1594. | Shellie, Mondello, et al., 2002 | 30. m/0.25 mm/0.25 μm, He, 45. C @ 6. min, 3. K/min; Tend: 250. C |
Capillary | RTX-Wax | 1597. | Shellie, Mondello, et al., 2002 | 30. m/0.25 mm/0.25 μm, He, 45. C @ 6. min, 3. K/min; Tend: 250. C |
Capillary | Carbowax 20M | 1597. | Mondello, Dugo, et al., 1995 | 60. m/0.32 mm/0.425 μm, He, 45. C @ 3. min, 3. K/min, 300. C @ 20. min |

Normal alkane RI, non-polar column, temperature ramp

Column type | Active phase | I | Reference | Comment |
---|---|---|---|---|
Capillary | BP-1 | 1275. | Ottavioli, Bighelli, et al., 2009 | 50. m/0.22 mm/0.25 μm, Helium, 2. K/min, 220. C @ 20. min; Tstart: 60. C |
Capillary | DB-5 | 1291. | Porto, Decorti, et al., 2009 | 30. m/0.25 mm/0.25 μm, Helium, 45. C @ 3. min, 3. K/min, 250. C @ 5. min |
Capillary | HP-5 MS | 1292. | Zhao, Zeng, et al., 2009 | 30. m/0.25 mm/0.25 μm, Helium, 4. K/min; Tstart: 50. C; Tend: 280. C |
Capillary | HP-5 MS | 1289. | Sahraoui, Vian, et al., 2008 | 30. m/0.25 mm/0.25 μm, Helium, 60. C @ 8. min, 2. K/min, 250. C @ 15. min |
Capillary | HP-5MS | 1283. | Basta, Pavlovic, et al., 2007 | 30. m/0.25 mm/0.25 μm, He, 3. K/min; Tstart: 60. C; Tend: 280. C |
Capillary | HP-1 | 1272. | Filippi, Lanfranchi, et al., 2006 | 50. m/0.2 mm/0.33 μm, He, 2. K/min, 250. C @ 40. min; Tstart: 60. C |
Capillary | DB-1 | 1272. | Hadian, Sonboli, et al., 2006 | 60. m/0.25 mm/0.25 μm, 5. K/min, 250. C @ 10. min; Tstart: 60. C |
Capillary | DB-1 | 1269. | Iranshahi, Amin, et al., 2006 | 30. m/0.25 mm/0.25 μm, He, 50. C @ 1. min, 2.5 K/min, 265. C @ 20. min |
Capillary | Methyl Silicone | 1272. | Kitchlu, Bakshi, et al., 2006 | 25. m/0.25 mm/0.25 μm, He, 90. C @ 2. min, 7. K/min; Tend: 220. C |
Capillary | DB-1 | 1273. | Fakhari, Salehi, et al., 2005 | 60. m/0.25 mm/0.25 μm, He, 5. K/min; Tstart: 60. C; Tend: 250. C |
Capillary | SPB-1 | 1274. | Hamilton, Hall, et al., 2005 | 30. m/0.25 mm/0.2 μm, 60. C @ 2. min, 6. K/min; Tend: 250. C |
Capillary | DB-5MS | 1292. | Hamilton, Hall, et al., 2005 | 30. m/0.25 mm/0.25 μm, 40. C @ 2. min, 10. K/min, 250. C @ 10. min |
Capillary | SPB-1 | 1273. | Wong and Tan, 2005 | 50. m/0.2 mm/0.33 μm, He, 50. C @ 3. min, 4. K/min, 220. C @ 30. min |
Capillary | HP-5MS | 1286. | Sadeghpour, Asghari, et al., 2004 | 30. m/0.25 mm/0.25 μm, He, 4. K/min; Tstart: 60. C; Tend: 280. C |
Capillary | HP-5 | 1294. | Yassa, Akhani, et al., 2003 | 30. m/0.25 mm/0.32 μm, He, 60. C @ 30. min, 5. K/min; Tend: 250. C |
Capillary | SPB-1 | 1291. | Fraternale, Giamperi, et al., 2000 | 30. m/0.2 mm/0.2 μm, He, 80. C @ 3. min, 5. K/min; Tend: 300. C |
Capillary | CP Sil 5 CB | 1276. | Weyerstahl, Marschall, et al., 1999 | N2, 5. K/min; Column length: 25. m; Phase thickness: 0.39 μm; Tstart: 60. C; Tend: 220. C |

Normal alkane RI, non-polar column, custom temperature program

Column type | Active phase | I | Reference | Comment |
---|---|---|---|---|
Capillary | HP-5 MS | 1291. | Sharopov, Sulaimonova, et al., 2012 | 30. m/0.25 mm/0.25 μm, Helium; Program: 40 0C (10 min) 3 0C/min -> 200 0C 2 0C/min -> 220 0C |
Capillary | Siloxane, 5 % Ph | 1283. | VOC BinBase, 2012 | Program: not specified |
Capillary | Polydimethyl siloxane, 5 % phenyl | 1283. | Skogerson, Wohlgemuth, et al., 2011 | Program: not specified |
Capillary | DB-1 | 1278. | Mendes, Trindade, et al., 2009 | 30. m/0.25 mm/0.25 μm, Hydrogen; Program: 45 0C 3 0C/min -> 175 0C 15 0C/min -> 300 0C (10 min) |
Capillary | DB-5 | 1298. | Porto, Decorti, et al., 2009 | 30. m/0.25 mm/0.25 μm, Helium; Program: not specified |
Capillary | 1266. | El-Shazily, Hafez, et al., 2004 | Program: not specified | |
Capillary | CP Sil 8 CB | 1289. | Judpentienë and Mockutë, 2004 | He; Column length: 50. m; Column diameter: 0.32 mm; Program: 60C(2min) => 5C/min => 160C (1min) => 10C/min => 250C (2min) |
Capillary | SE-30 | 1276. | Vinogradov, 2004 | Program: not specified |
Capillary | HP-5 | 1289. | Demyttenaere, Dagher, et al., 2003 | 30. m/0.25 mm/0.25 μm, He; Program: 40C(1min) => 5C/min => 180C => 10C/min => 220C(2min) |
Capillary | HP-5MS | 1289. | Demyttenaere, Dagher, et al., 2002 | 30. m/0.25 mm/0.25 μm, He; Program: 40C(1min) => 5C/min => 220C => 10C/min => 240C(2min) |
Capillary | Methyl Silicone | 1276. | Zenkevich, 1999 | Program: not specified |
Capillary | DB-5 | 1289. | Isidorov, Zenkevich, et al., 1997 | Program: not specified |
Capillary | CP Sil 5 CB | 1273. | Weyerstahl, Marschall, et al., 1997 | N2; Column length: 30. m; Column diameter: 0.25 mm; Program: not specified |
Capillary | 5 % Phenyl methyl siloxane | 1274. | Sagrero-Nieves and Bartley, 1995 | Program: not specified |

Normal alkane RI, polar column, temperature ramp

Column type | Active phase | I | Reference | Comment |
---|---|---|---|---|
Capillary | BP-20 | 1586. | Ottavioli, Bighelli, et al., 2009 | 50. m/0.22 mm/0.25 μm, Helium, 2. K/min, 220. C @ 20. min; Tstart: 60. C |
Capillary | HP-20M | 1576. | Filippi, Lanfranchi, et al., 2006 | 50. m/0.2 mm/0.1 μm, He, 2. K/min, 220. C @ 30. min; Tstart: 60. C |
Capillary | FFAP | 1638. | Kitchlu, Bakshi, et al., 2006 | 20. m/0.25 mm/0.25 μm, He, 6. K/min; Tstart: 90. C; Tend: 250. C |
Capillary | DB-Wax | 1593. | Hamilton, Hall, et al., 2005 | 30. m/0.25 mm/0.25 μm, 40. C @ 2. min, 10. K/min, 250. C @ 10. min |
Capillary | DB-Wax | 1608. | Hamilton, Hall, et al., 2005 | 30. m/0.25 mm/0.2 μm, 60. C @ 2. min, 6. K/min; Tend: 250. C |
Capillary | Supelcowax-10 | 1606. | Wong and Tan, 2005 | 30. m/0.25 mm/0.25 μm, He, 50. C @ 3. min, 4. K/min, 220. C @ 30. min |
Capillary | DB-Wax | 1606. | Umano, Hagi, et al., 2000 | 60. m/0.25 mm/0.25 μm, He, 40. C @ 2. min, 2. K/min; Tend: 200. C |
Capillary | DB-Wax | 1615. | Weyerstahl, Marschall, et al., 1999 | N2, 5. K/min; Column length: 60. m; Phase thickness: 0.25 μm; Tstart: 60. C; Tend: 220. C |

Normal alkane RI, polar column, custom temperature program

Column type | Active phase | I | Reference | Comment |
---|---|---|---|---|
Capillary | Innowax FSC | 1617. | Polatoglu, Demirci, et al., 2010 | 60. m/0.25 mm/0.25 μm, Helium; Program: 60 0C (10 min) 4 0C/min -> 220 0C (10 min) 1 0C/min -> 240 0C |
Capillary | HP-Innowax FSC | 1617. | Tabanca N., Demirci B., et al., 2007 | 60. m/0.25 mm/0.25 μm, He; Program: 60C(10min) => 4C/min => 220C(10min) => 1C/min => 240C |
Capillary | HP-Innowax FSC | 1617. | Tabanca, Demirci, et al., 2006 | 60. m/0.25 mm/0.25 μm; Program: 60C(10min) => 4C/min => 220C (10min) => 1C/min => 240C |
Capillary | Carbowax 20M | 1610. | Vinogradov, 2004 | Program: not specified |

References

Szabolcs, Benecke, et al., 1985
Szabolcs, N.; Benecke, R.; Thieme, H.,
Természetes eredetu növényi anyagok gázkromatográfiás retenciós tulajdonságai. I. A lavandula- és lavandinolaj fo kimponenseinek retenciós indexei,
Acta Pharm. Hung., 1985, 55, 49-58. [all data]
Benecke, Thieme, et al., 1982
Benecke, R.; Thieme, H.; Nyiredy, Sz.,
Retentionsverhalten der Hauptkomponenten der Lavendel und Lavandinöle an Verschiedenen stationären Phasen in Abhängigkeit von der Säulentemperatur,
J. Chromatogr., 1982, 238, 1, 75-87, https://doi.org/10.1016/S0021-9673(00)82713-2
. [all data]
Angioni, Barra, et al., 2006
Angioni, A.; Barra, A.; Coroneo, V.; Dessi, S.; Cabras, P.,
Chemical composition, seasonal variability, and antifungal activity of Lavandula stoechas L. ssp. stoechas essential oils from stem/leaves and flowers,
J. Agric. Food Chem., 2006, 54, 12, 4364-4370, https://doi.org/10.1021/jf0603329
. [all data]
Raina, Verma, et al., 2006
Raina, V.K.; Verma, S.C.; Dhawan, S.; Khan, M.; Ramesh, S.; Singh, S.C.; Yadav, A.; Srivastava, S.K.,
Essential oil composition of Murraya exotica from the plains of northern India,
Flavour Fragr. J., 2006, 21, 1, 140-142, https://doi.org/10.1002/ffj.1547
. [all data]
Asuming, Beauchamp, et al., 2005
Asuming, W.A.; Beauchamp, P.S.; Descalzo, J.T.; Dev, B.C.; Dev, V.; Frost, S.; Ma, C.W.,
Essential oil composition of four Lomatium Raf. species and their chemotaxonomy,
Biochem. Syst. Ecol., 2005, 33, 1, 17-26, https://doi.org/10.1016/j.bse.2004.06.005
. [all data]
Avato, Raffo, et al., 2004
Avato, P.; Raffo, F.; Aldouri, N.A.; Vartanian, S.T.,
Essential oils of varthemia iphionoides from Jordan,
Flavour Fragr. J., 2004, 19, 6, 559-561, https://doi.org/10.1002/ffj.1351
. [all data]
Raina, Lal, et al., 2002
Raina, V.K.; Lal, R.K.; Tripathi, S.; Khan, M.; Syamasundar, K.V.; Srivastava, S.K.,
Erratum. Essential oil composition of genetically diverse stocks of Murraya koenigii from India,
Flavour Fragr. J., 2002, 17, 5, 404, https://doi.org/10.1002/ffj.1139
. [all data]
Palá-Paúl, Velasco-Negueruela, et al., 2001
Palá-Paúl, J.; Velasco-Negueruela, A.; Pérez-Alonso, M.J.; Sanz, J.,
Analysis of the volatile components of Argyranthemum adauctum (Link.) Humphries by gas chromatography-mass spectrometry,
J. Chromatogr. A, 2001, 923, 1-2, 295-298, https://doi.org/10.1016/S0021-9673(01)01003-2
. [all data]
Loayza, Abujder, et al., 1995
Loayza, I.; Abujder, D.; Aranda, R.; Jakupovic, J.; Collin, G.; Deslauriers, H.; Jean, F.-I.,
Essential oils of Baccharis salicifolia, B. latifolia and B. dracunculifolia,
Phytochemistry, 1995, 38, 2, 381-389, https://doi.org/10.1016/0031-9422(94)00628-7
. [all data]
Wong and Tie, 1993
Wong, K.C.; Tie, D.Y.,
The Essential Oil of the Leaves of Murraya koenigii Spreng.,
J. Essent. Oil Res., 1993, 5, 4, 371-374, https://doi.org/10.1080/10412905.1993.9698245
. [all data]
Tuberoso, Kowalczyk, et al., 2005
Tuberoso, C.I.G.; Kowalczyk, A.; Coroneo, V.; Russo, M.T.; Dessì, S.; Cabras, P.,
Chemical Composition and Antioxidant, Antimicrobial, and Antifungal Activities of the Essential Oil of Achillea ligustica All.,
J. Agric. Food Chem., 2005, 53, 26, 10148-10153, https://doi.org/10.1021/jf0518913
. [all data]
Daferera, Ziogas, et al., 2003
Daferera, D.J.; Ziogas, B.N.; Polissiou, M.G.,
The effectiveness of plant essential oils on the growth of Botrytis cinerea, Fusarium sp. and Clavibacter michiganensis subsp. michiganensis,
Crop Prot., 2003, 22, 1, 39-44, retrieved from http://www.elsevier.com/gej-ng/10/25/40/84/25/31/article.pdf, https://doi.org/10.1016/S0261-2194(02)00095-9
. [all data]
ter Heide, 1968
ter Heide, R.,
Studies on terpenes. II. Characterization of monoterpene esters by gas and thin-layer chromatography,
Z. Anal. Chem., 1968, 236, 215-227. [all data]
Muselli, Rossi, et al., 2007
Muselli, A.; Rossi, P.-G.; Desjobert, J.-M.; Bernardini, A.-F.; Berti, L.; Costa, J.,
Chemical composition and antibacterial activity of Otanthus maritimus (L.) Hoffmanns. Link essential oils from Corsica,
Flavour Fragr. J., 2007, 22, 3, 217-223, https://doi.org/10.1002/ffj.1787
. [all data]
Cavalli, Tomi, et al., 2006
Cavalli, J.-F.; Tomi, F.; Bernardini, A.-F.; Casanova, J.,
Chemical variability of the essential oil of Helichrysum faradifani Sc. Ell. from Madagascar,
Flavour Fragr. J., 2006, 21, 1, 111-114, https://doi.org/10.1002/ffj.1531
. [all data]
Dob, Dahmane, et al., 2006
Dob, T.; Dahmane, D.; Agli, M.; Chelghoum, C.,
Essential oil composition of Lavandula stoechas from Algeria,
Pharm. Biol., 2006, 44, 1, 60-64, https://doi.org/10.1080/13880200500496421
. [all data]
Saroglou, Dorizas, et al., 2006
Saroglou, V.; Dorizas, N.; Kypriotakis, Z.; Skaltsa, H.D.,
Analysis of the essential oil composition of eight Anthemis species from Greece,
J. Chromatogr. A, 2006, 1104, 1-2, 313-322, https://doi.org/10.1016/j.chroma.2005.11.087
. [all data]
Dob, Dahmane, et al., 2005
Dob, T.; Dahmane, D.; Berramdane, T.; Chelghoum, C.,
Chemical composition of the essential oil of Artemisia campestris L. from Algeria,
Pharm. Biol., 2005, 43, 6, 512-514, https://doi.org/10.1080/13880200500220664
. [all data]
Javidnia, Miri, et al., 2005
Javidnia, K.; Miri, R.; Kamalinejad, M.; Edraki, N.,
Chemical composition of Ferula persica Wild. essential oil from Iran,
Flavour Fragr. J., 2005, 20, 6, 605-606, https://doi.org/10.1002/ffj.1496
. [all data]
Paolini, Costa, et al., 2005
Paolini, J.; Costa, J.; Bernardini, A.,
Analysis of the essential oil from aerial parts of Eupatorium cannabinum subsp. corsicum (L.) by gas chromatography with electron impact and chemical ionization mass spectrometry,
J. Chromatogr. A, 2005, 1076, 1-2, 170-178, https://doi.org/10.1016/j.chroma.2005.03.131
. [all data]
Vellutini, Baldovini, et al., 2005
Vellutini, M.; Baldovini, N.; de Rocca Serra, D. Tomi; Casanova, J.,
β-Cyclolavandulyl and β-isocyclolavandulyl esters from Peucedanum paniculatum L., an endemic species to Corsica,
Phytochemistry, 2005, 66, 16, 1956-1962, https://doi.org/10.1016/j.phytochem.2005.07.001
. [all data]
Salido, Valenzuela, et al., 2004
Salido, S.; Valenzuela, L.R.; Altarejos, J.; Nogueras, M.; Sánchez, A.; Cano, E.,
Composition and infraspecific variability of Artemisia herba-alba from southern Spain,
Biochem. Syst. Ecol., 2004, 32, 3, 265-277, https://doi.org/10.1016/j.bse.2003.09.002
. [all data]
Bader, Flamini, et al., 2003
Bader, A.; Flamini, G.; Cioni, P.L.; Morelli, I.,
Essential oil composition of Achillea santolina L. and Achillea biebersteinii Afan. collected in Jordan,
Flavour Fragr. J., 2003, 18, 1, 36-38, https://doi.org/10.1002/ffj.1147
. [all data]
Tampieri, Galuppi, et al., 2003
Tampieri, M.P.; Galuppi, R.; Carelle, M.S.; Macchioni, F.; Cioni, P.L.; Morelli, I.,
Effect of selected essential oils and pure compounds on Saprolegnia parasitica,
Pharm. Biol., 2003, 41, 8, 584-591, https://doi.org/10.1080/13880200390501839
. [all data]
Pino, Marbot, et al., 2002
Pino, J.; Marbot, R.; Rosado, A.,
Volatile constituents of star apple (Chrysophyllum cainito L.) from Cuba,
Flavour Fragr. J., 2002, 17, 5, 401-403, https://doi.org/10.1002/ffj.1116
. [all data]
Shellie, Mondello, et al., 2002
Shellie, R.; Mondello, L.; Marriott, P.; Dugo, G.,
Characterisation of lavender essential oils by using gas chromatography-mass spectrometry with correlation of linear retention indices and comparison with comprehensive two-dimensional gas chromatography,
J. Chromatogr. A, 2002, 970, 1-2, 225-234, https://doi.org/10.1016/S0021-9673(02)00653-2
. [all data]
Couladis, Tsortanidou, et al., 2001
Couladis, M.; Tsortanidou, V.; Francisco-Ortega, J.; Santos-Guerra, A.; Harvala, C.,
Composition of the essential oils of Argyranthemum species growing in the Canary Islands,
Flavour Fragr. J., 2001, 16, 2, 103-106, https://doi.org/10.1002/ffj.954
. [all data]
Salido, Altarejos, et al., 2001
Salido, S.; Altarejos, J.; Nogueras, M.; Sánchez, A.,
Chemical composition of the essential oil of Artemisia herba-alba Asso ssp. valentina (Lam.) Marcl.,
J. Essent. Oil Res., 2001, 13, 4, 221-224, https://doi.org/10.1080/10412905.2001.9699675
. [all data]
Tret'yakov, 2008
Tret'yakov, K.V.,
Retention Data. NIST Mass Spectrometry Data Center., NIST Mass Spectrometry Data Center, 2008. [all data]
Sanz, Soria, et al., 2004
Sanz, J.; Soria, A.C.; García-Vallejo, M.C.,
Analysis of volatile components of Lavandula luisieri L. by direct thermal desorption-gas chromatography-mass spectrometry,
J. Chromatogr. A, 2004, 1024, 1-2, 139-146, https://doi.org/10.1016/j.chroma.2003.10.024
. [all data]
Mondello, Dugo, et al., 1995
Mondello, L.; Dugo, P.; Basile, A.; Dugo, G.,
Interactive use of linear retention indices, on polar and apolar columns, with a MS-library for reliable identification of complex mixtures,
J. Microcolumn Sep., 1995, 7, 6, 581-591, https://doi.org/10.1002/mcs.1220070605
. [all data]
Ottavioli, Bighelli, et al., 2009
Ottavioli, J.; Bighelli, A.; Casanova, J.; Bang, B.T.; Y.,
GC (retention indices), GC-MS, and 13C NMR of two citral-rich Cymbopogon leaf oils: C. Flexuosus and C. tortilis,
Spectroscopy Lett., 2009, 42, 8, 506-512, https://doi.org/10.1080/00387010903022350
. [all data]
Porto, Decorti, et al., 2009
Porto, C.Da.; Decorti, D.; Kikic, I.,
Flavour compounds of Lavandula angustifolia L. to use in food manufacturing: comparison of three different extraction methods,
Food Chem., 2009, 112, 4, 1072-1078, https://doi.org/10.1016/j.foodchem.2008.07.015
. [all data]
Zhao, Zeng, et al., 2009
Zhao, C.; Zeng, Y.; Wan, M.; Li, R.; Liang, Y.; Li, C.; Zeng, Z.; Chau, F.-T.,
Comparative analysis of essential oils from eight herbal medicines with pungent flavor and cool nature by GC-MS and chemometric resolution methods,
J. Sep. Sci., 2009, 32, 4, 660-670, https://doi.org/10.1002/jssc.200800484
. [all data]
Sahraoui, Vian, et al., 2008
Sahraoui, N.; Vian, M.A.; Bornard, I.; Boutekedjiret, C.; Chemat, F.,
Improved microwave steam distillation apparatus for isolation of essential oils. Comparison with conventional steam distillation,
J. Chromatogr. A., 2008, 1210, 2, 229-233, https://doi.org/10.1016/j.chroma.2008.09.078
. [all data]
Basta, Pavlovic, et al., 2007
Basta, A.; Pavlovic, M.; Couladis, M.; Tzakou, O.,
Essential oil composition of the flowerheads of Chrysanthemum coronarium L. from Greece,
Flavour Fragr. J., 2007, 22, 3, 197-200, https://doi.org/10.1002/ffj.1781
. [all data]
Filippi, Lanfranchi, et al., 2006
Filippi, J.-J.; Lanfranchi, D.-A.; Prado, S.; Baldovini, N.; Meierhenrich, U.J.,
Composition, Enantiomeric Distribution, and Antibacterial Activity of the Essential Oil of Achillea ligustica All. from Corsica,
J. Agric. Food Chem., 2006, 54, 17, 6308-6313, https://doi.org/10.1021/jf060752y
. [all data]
Hadian, Sonboli, et al., 2006
Hadian, J.; Sonboli, A.; Ebrahimi, S.N.; Mirjalili, M.H.,
Essential oil composition of Nepeta satureioides from Iran,
Chem. Nat. Compd. (Engl. Transl.), 2006, 42, 2, 175-177, https://doi.org/10.1007/s10600-006-0071-0
. [all data]
Iranshahi, Amin, et al., 2006
Iranshahi, M.; Amin, G.; Sourmaghi, M.S.; Shafiee, A.; Hadjiakhoondi, A.,
Sulphur-containing compounds in the essential oil of the root of Ferula persica Willd. var. persica,
Flavour Fragr. J., 2006, 21, 2, 260-261, https://doi.org/10.1002/ffj.1574
. [all data]
Kitchlu, Bakshi, et al., 2006
Kitchlu, S.; Bakshi, S.K.; Kaul, M.K.; Bhan, M.K.; Thapa, R.K.; Agarwal, S.G.,
Tanacetum gracile Hook. f T. A new source of lavandulol from Ladakh Himalaya (India),
Flavour Fragr. J., 2006, 21, 4, 690-692, https://doi.org/10.1002/ffj.1674
. [all data]
Fakhari, Salehi, et al., 2005
Fakhari, A.R.; Salehi, P.; Heydari, R.; Ebrahimi, S.N.; Haddad, P.R.,
Hydrodistillation-headspace solvent microextraction, a new method for analysis of the essential oil components of Lavandula angustifolia Mill.,
J. Chromatogr. A, 2005, 1098, 1-2, 14-18, https://doi.org/10.1016/j.chroma.2005.08.054
. [all data]
Hamilton, Hall, et al., 2005
Hamilton, J.G.C.; Hall, D.R.; Kirk, W.D.J.,
Identification of a male-produced aggregation pheromone in the western flower thrips,
J. Chem. Ecol., 2005, 31, 6, 1369-1379, https://doi.org/10.1007/s10886-005-1351-z
. [all data]
Wong and Tan, 2005
Wong, K.C.; Tan, C.H.,
Volatile constituents of the flowers of Clerodendron fragrans (Vent.) R. Br.,
Flavour Fragr. J., 2005, 20, 4, 429-430, https://doi.org/10.1002/ffj.1457
. [all data]
Sadeghpour, Asghari, et al., 2004
Sadeghpour, O.; Asghari, G.; Ardekani, M.R.S.,
Composition of essential oil of Artemisia persica Boiss. from Iran,
Iran. J. Pharm. Res., 2004, 3, 65-67. [all data]
Yassa, Akhani, et al., 2003
Yassa, N.; Akhani, H.; Aqaahmadi, M.; Salimian, M.,
Essential oils from two endemic species of Apiaceae from Iran,
Z. Naturforsch. C:, 2003, 58, 459-463. [all data]
Fraternale, Giamperi, et al., 2000
Fraternale, D.; Giamperi, L.; Ricci, D.; Manunta, A.,
Composition of the essential oil of Peucedanum verticillare,
Biochem. Syst. Ecol., 2000, 28, 2, 143-147, https://doi.org/10.1016/S0305-1978(99)00049-6
. [all data]
Weyerstahl, Marschall, et al., 1999
Weyerstahl, P.; Marschall, H.; Thefeld, K.; Rustaiyan, A.,
Constituents of the essential oil of Tanacetum (syn. Chrysanthemum) fruticulosum Ledeb. from Iran,
Flavour Fragr. J., 1999, 14, 2, 112-120, https://doi.org/10.1002/(SICI)1099-1026(199903/04)14:2<112::AID-FFJ786>3.0.CO;2-1
. [all data]
Sharopov, Sulaimonova, et al., 2012
Sharopov, F.S.; Sulaimonova, V.A.; Setzer, W.N.,
Composition of the essential oil of Ertemisia absinthium from Tajikistan,
Rec. Nat. Prod., 2012, 6, 2, 127-134. [all data]
VOC BinBase, 2012
VOC BinBase,
The volatile compound BinBase (VOC BinBase), 2012, retrieved from http://fiehnlab.ucdavis.edu/projects/VocBinBase and http://binbase.sourceforge.net. [all data]
Skogerson, Wohlgemuth, et al., 2011
Skogerson, K.; Wohlgemuth, G.; Fiehn, O.,
VocBinNase, 2011, retrieved from http://fiehnlab.ucdavis.edu/projects//VocBinBase. [all data]
Mendes, Trindade, et al., 2009
Mendes, M.D.; Trindade, H.; Figueiredo, A.C.; Barroso, J.G.; Fontinha, S.S.; Pedro, L.G.,
Volatile and molecular characterization of two Portuguese endemic species: Angelica lignescens and Melanoselinium decipiens,
Biochen. Systematics Ecol., 2009, 37, 2, 98-105, https://doi.org/10.1016/j.bse.2008.12.006
. [all data]
El-Shazily, Hafez, et al., 2004
El-Shazily, A.M.; Hafez, S.S.; Wink, M.,
Comparative study of the essential oils and extracts of Achillea fragrantissima (Forssk.) Sch. Bip. and Achillea santolina L. (Asteraceae) from Egypt,
Pharmazie, 2004, 59, 226-230. [all data]
Judpentienë and Mockutë, 2004
Judpentienë, A.; Mockutë, D.,
Chemical composition of essential oils produced by pink flower inflorescences of wild Achillea millefolium L.,
Chemija, 2004, 15, 28-32. [all data]
Vinogradov, 2004
Vinogradov, B.A.,
Production, composition, properties and application of essential oils, 2004, retrieved from http://viness.narod.ru. [all data]
Demyttenaere, Dagher, et al., 2003
Demyttenaere, J.C.R.; Dagher, C.; Sandra, P.; Kallithraka, S.; Verhé, R.; de Kimpe, N.,
Flavour analysis of Greek white wine by solid-phase microextraction-capillary gas chromatography-mass spectrometry,
J. Chromatogr. A, 2003, 985, 1-2, 233-246, https://doi.org/10.1016/S0021-9673(02)01467-X
. [all data]
Demyttenaere, Dagher, et al., 2002
Demyttenaere, J.C.R.; Dagher, C.; Verhé, R.; Sandra, P.,
Flavour analysis of Greek white wine using solid phase microextraction - capillary GC/MS
in 25th International Symposium on Capillary Chromatography, 2002, 1-16. [all data]
Zenkevich, 1999
Zenkevich, I.G.,
Analytical Parameters of Components of essential Oils for their Gas Chromatographic and Chromato-Mass-Spectral Identification. Acetates of Terpene Alcohols,
Rastitelnye Resursy (Plant Resources), 1999, 35, 1, 30-37. [all data]
Isidorov, Zenkevich, et al., 1997
Isidorov, V.; Zenkevich, I.; Sacharevich, T.,
Calculation of Gas Chromatographic Retention Indices for Monoterpenes and Terpenoids from Their Physico-Chemical Constants,
Chem. Anal. (Warsaw), 1997, 42, 627-634. [all data]
Weyerstahl, Marschall, et al., 1997
Weyerstahl, P.; Marschall, H.; Seelmann, I.; Rustaiyan, A.,
Constituents of the essential oil of Achillea eriophora DC,
Flavour Fragr. J., 1997, 12, 2, 71-78, https://doi.org/10.1002/(SICI)1099-1026(199703)12:2<71::AID-FFJ620>3.0.CO;2-E
. [all data]
Sagrero-Nieves and Bartley, 1995
Sagrero-Nieves, L.; Bartley, J.P.,
Volatile Constituents from the Leaves of Chenopodium ambrosioides L.,
J. Essent. Oil Res., 1995, 7, 2, 221-223, https://doi.org/10.1080/10412905.1995.9698506
. [all data]
Umano, Hagi, et al., 2000
Umano, K.; Hagi, Y.; Nakahara, K.; Shoji, A.; Shibamoto, T.,
Volatile chemicals identified in extracts from leaves of Japanese mugwort (Artemisia princeps Pamp.),
J. Agric. Food Chem., 2000, 48, 8, 3463-3469, https://doi.org/10.1021/jf0001738
. [all data]
Polatoglu, Demirci, et al., 2010
Polatoglu, K.; Demirci, F.; Demirci, B.; Goren, N.; Baser, K.H.C.,
Antimicrobial activity and essential oil composition of a new T. argyrophyllum (C. Koch) Tvzel var. argyrophyllium chemotype,
J. Oleo Sci., 2010, 59, 6, 307-313, https://doi.org/10.5650/jos.59.307
. [all data]
Tabanca N., Demirci B., et al., 2007
Tabanca N.; Demirci B.; Baser K.H.C.; Mincsovics E.; Khan S.I.; Jacob M.R.; Wedge D.E.,
Characterization of volatile constituents of Scaligeria tripartita and studies on the antifungal activity against phytopathogenic fungi,
J. Chromatogr. B, 2007, 850, 1-2, 221-229, https://doi.org/10.1016/j.jchromb.2006.11.041
. [all data]
Tabanca, Demirci, et al., 2006
Tabanca, N.; Demirci, B.; Ozek, T.; Kirimer, N.; Can Baser, K.H.; Bedir, E.; Khan, I.A.; Wedge, D.E.,
Gas chromatographic-mass spectrometric analysis of essential oils from Pimpinella species gathered from Central and Northern Turkey,
J. Chromatogr. A, 2006, 1117, 2, 194-205, https://doi.org/10.1016/j.chroma.2006.03.075
. [all data]