Benzene, 1-chloro-2-(1-methylethyl)-
- Formula: C9H11Cl
- Molecular weight: 154.637
- IUPAC Standard InChIKey: RNEMUWDQJSRDMQ-UHFFFAOYSA-N
- CAS Registry Number: 2077-13-6
- Chemical structure:
View 3d structure (requires JavaScript / HTML 5) - Other names: Cumene, o-chloro-; o-Chlorocumene; 2-Chloroisopropylbenzene; 2-chlorocumene

Condensed phase thermochemistry data

Data compiled by: Hussein Y. Afeefy, Joel F. Liebman, and Stephen E. Stein
Quantity | Value | Units | Method | Reference | Comment |
---|---|---|---|---|---|
ΔfH°liquid | -79.4 ± 2.1 | kJ/mol | Eqk | Nesterova, Rozhnov, et al., 1985 | |
ΔfH°liquid | -74.8 ± 1.9 | kJ/mol | Eqk | Nesterova, Rozhnov, et al., 1985 | |
ΔfH°liquid | -74.8 ± 1.9 | kJ/mol | Eqk | Nesterova, Rozhnov, et al., 1985 |

Phase change data

Data compiled as indicated in comments:
BS - Robert L. Brown and Stephen E. Stein
TRC - Thermodynamics Research Center, NIST Boulder Laboratories, Chris Muzny director
AC - William E. Acree, Jr., James S. Chickos
Quantity | Value | Units | Method | Reference | Comment |
---|---|---|---|---|---|
Tboil | 464.3 | K | N/A | Weast and Grasselli, 1989 | BS |
Tboil | 464.15 | K | N/A | Pines and Mark, 1956 | Uncertainty assigned by TRC = 2. K; TRC |
Enthalpy of vaporization
ΔvapH (kJ/mol) | Temperature (K) | Method | Reference | Comment |
---|---|---|---|---|
48.1 | 356. | N/A | Dykyj, Svoboda, et al., 1999 | Based on data from 341. to 465. K.; AC |
47.7 | 378. | A | Stephenson and Malanowski, 1987 | Based on data from 363. to 508. K. See also Dykyj and Vanko, 1970.; AC |

Reaction thermochemistry data

Data compiled by: Hussein Y. Afeefy, Joel F. Liebman, and Stephen E. Stein
Individual Reactions
By formula: C6H5Cl + C12H17Cl = C9H11Cl + C9H11Cl
Quantity | Value | Units | Method | Reference | Comment |
---|---|---|---|---|---|
ΔrH° | -0.84 ± 0.42 | kJ/mol | Eqk | Nesterova, Rozhnov, et al., 1985 | liquid phase |
By formula: C9H11Cl + C6H6 = C6H5Cl + C9H12
Quantity | Value | Units | Method | Reference | Comment |
---|---|---|---|---|---|
ΔrH° | -0.59 ± 0.42 | kJ/mol | Eqk | Nesterova, Rozhnov, et al., 1985 | liquid phase |
By formula: C9H11Cl = m-chlorocumene
Quantity | Value | Units | Method | Reference | Comment |
---|---|---|---|---|---|
ΔrH° | -3.35 ± 0.84 | kJ/mol | Eqk | Nesterova, Rozhnov, et al., 1985 | liquid phase |
By formula: C9H11Cl = C9H11Cl
Quantity | Value | Units | Method | Reference | Comment |
---|---|---|---|---|---|
ΔrH° | -2.51 ± 0.84 | kJ/mol | Eqk | Nesterova, Rozhnov, et al., 1985 | liquid phase |

Normal alkane RI, non-polar column, temperature ramp

Column type | Active phase | I | Reference | Comment |
---|---|---|---|---|
Capillary | OV-101 | 1102. | Zenkevich, 2001 | N2, 4. K/min; Column length: 25. m; Column diameter: 0.20 mm; Tstart: 60. C; Tend: 240. C |

References

Nesterova, Rozhnov, et al., 1985
Nesterova, T.N.; Rozhnov, A.M.; Malova, T.N.; Kovzel, E.N.,
Molar enthalpies of formation of isopropylchlorobenzenes derived from equilibrium measurements,
J. Chem. Thermodyn., 1985, 17, 649-656. [all data]
Weast and Grasselli, 1989
CRC Handbook of Data on Organic Compounds, 2nd Editon, Weast,R.C and Grasselli, J.G., ed(s)., CRC Press, Inc., Boca Raton, FL, 1989, 1. [all data]
Pines and Mark, 1956
Pines, H.; Mark, V.,
Carbanions Additions in the Reaction of Aromatic Hydrocarbons with Monoolefins,
J. Am. Chem. Soc., 1956, 78, 4316. [all data]
Dykyj, Svoboda, et al., 1999
Dykyj, J.; Svoboda, J.; Wilhoit, R.C.; Frenkel, M.L.; Hall, K.R.,
Vapor Pressure of Chemicals: Part A. Vapor Pressure and Antoine Constants for Hydrocarbons and Sulfur, Selenium, Tellurium and Hydrogen Containing Organic Compounds, Springer, Berlin, 1999, 373. [all data]
Stephenson and Malanowski, 1987
Stephenson, Richard M.; Malanowski, Stanislaw,
Handbook of the Thermodynamics of Organic Compounds, 1987, https://doi.org/10.1007/978-94-009-3173-2
. [all data]
Dykyj and Vanko, 1970
Dykyj, J.; Vanko, A.,
Petrochemica, 1970, 10, 1, 3. [all data]
Zenkevich, 2001
Zenkevich, I.G.,
Interpretation of Gas Chromatographic Retention Indices in estimation of Structures of Isomeric Products of Radical Chlorinating of Alkyl Arenes,
Zh. Org. Khim., 2001, 37, 2, 283-293. [all data]